program: Gaussian 09
title: 000205914
version: EM64L-G09RevD.01
frameworkgroup: C1[X(C11H10I3NO3)]
method: RPBEPBE
basis: SDD
operation: Freq
keyword: #p
keyword: freq=noraman
keyword: PBEPBE/SDD
title: #p freq=noraman PBEPBE/SDD
converged: YES YES NO NO
title: Mulliken charges:
elementType: I I I O O O N C C C C C C C C C C C H H H H H H H H H H
charge: 0.131516 0.144027 0.147377 -0.243318 -0.411877 -0.244569 -0.270393 -0.511830 0.675291 0.227902 -0.487897 -0.652375 -0.423729 -0.431463 -0.125910 -0.126454 -0.358911 0.186124 0.248030 0.276227 0.297001 0.262096 0.251087 0.250837 0.259956 0.276786 0.277249 0.377221
chargesum: 0.00000
title: Mulliken charges with hydrogens summed into heavy atoms:
elementType: I I I O O O N C C C C C C C C C C C
charge: 0.131516 0.144027 0.147377 -0.243318 -0.034656 -0.244569 -0.270393 0.012426 0.675291 0.227902 0.071199 0.109505 -0.423729 -0.431463 0.150876 0.150796 -0.358911 0.186124
polarizability: 2.85496601e+02 -9.70433619e-01 2.27363767e+02 2.17798318e+01 -4.05851923e+00 1.13999146e+02
1716.lowfreq: -16.3876 -6.4381 -0.0002 -0.0001 0.0005 2.5816 11.5080 19.1840 23.1184
frequency: 8.3731 19.1720 22.5967 38.4241 58.4375 70.9414 78.6973 80.1564 81.2374 90.2762 119.2138 130.5729 143.1427 162.4029 164.0565 195.6406 255.1374 265.2294 272.1358 318.2643 357.1109 396.3531 464.4876 494.3159 495.9693 512.1713 528.9317 568.8736 582.9418 609.1406 636.4597 649.3042 681.3813 738.7483 751.3114 805.4390 861.2080 872.6119 886.5581 903.5591 1006.0483 1013.0115 1047.4778 1082.2092 1087.0343 1098.3876 1115.8627 1133.5772 1154.4750 1188.3090 1228.7776 1250.7323 1261.8807 1296.3180 1323.3038 1344.6530 1351.9133 1382.0718 1415.2457 1440.7657 1443.0643 1448.4764 1474.2039 1483.3825 1520.0539 1546.7411 1598.6971 1660.8319 2977.9056 2985.1872 3004.5249 3041.2650 3073.8371 3076.0806 3107.6157 3183.8432 3186.3974 3513.7002
redmass: 9.8898 17.3948 7.4552 4.2855 7.3900 3.5796 28.9765 2.6460 3.3637 3.9095 4.4167 5.8917 2.3810 60.7807 4.5525 5.5435 4.5103 5.7039 7.7130 6.8240 9.2290 5.0928 3.5006 4.1726 3.9901 2.3810 5.4139 3.7797 4.0327 3.9200 3.7010 1.6786 9.7565 6.3445 6.3169 1.7417 4.4484 1.4547 1.3674 3.5591 6.3228 2.2405 2.9752 2.8082 2.2895 1.3883 2.1144 2.1994 1.2200 1.8094 1.5461 2.5477 1.2792 2.0680 4.9200 3.1498 2.4746 2.1979 2.9356 1.0869 1.2230 1.0952 1.0520 1.0820 9.5371 8.3076 9.2833 8.0662 1.0386 1.0618 1.0648 1.0970 1.0961 1.0959 1.1012 1.0932 1.0939 1.0639
irintensity: 0.1162 0.0479 0.6109 2.2339 1.7335 2.3551 0.0692 0.3945 2.4384 0.2743 0.5440 0.8731 1.4581 0.0055 0.0603 9.6812 1.7693 0.9351 1.0219 4.2167 17.1466 3.3024 14.1115 5.5518 7.1061 56.4996 5.4978 20.9929 25.7883 36.0081 19.4878 116.3883 59.9550 3.9545 40.1916 14.2236 1.4008 28.9427 0.0020 4.4940 27.2691 39.1258 111.4894 187.1622 61.8244 1.6335 19.0793 8.1942 0.4676 17.7696 22.2900 31.7441 51.2557 6.3405 9.3908 46.5316 226.7048 0.6815 193.2732 14.3713 9.8388 61.2853 9.4127 60.7993 84.9264 79.9052 185.4687 185.8062 43.0741 10.2105 29.9947 7.7256 15.0841 3.3476 19.1868 0.5204 0.1628 25.7895
temp: 298.150 k
press: 1.00000 atm
elementType: 53 53 53 8 8 8 7 6 6 6 6 6 6 6 6 6 6 6 1 1 1 1 1 1 1 1 1 1
symmnumber: 1
zpe: 495964.8 jmol-1
zpe.correction: 0.188903 hartree
zpe.thermalcorrener: 0.209232 hartree
zpe.thermalcorrenthalpy: 0.210177 hartree
zpe.thermalcorrgfe: 0.131580 hartree
zpe.sumelectzpe: -738.795308 hartree
zpe.sumelectthermal: -738.774979 hartree
zpe.sumelectthermalent: -738.774034 hartree
zpe.sumelectthermalfe: -738.852631 hartree
dipole: -0.0292 -0.7248 -2.9328
dipole: 3.0212
quadrupole: -137.3868 -144.3036 -151.6059
quadrupole: 5.8342 1.4130 2.1522
quadrupole: 7.0453 0.1285 -7.1738 5.8342 1.4130 2.1522
hfenergy: -738.984211 hartree
pointgroup: C01 [X(C11H10I3N1O3)]
dipole: 0.0951915 0.3783597 1.1227882 debye
polarizability: 279.7475175|-1.7608379|225.9400504|-37.6473885|-13.2452371|121.1719466 unknown
InChI: InChI=1S/C11H10I3NO3/c1-15(9(16)2-3-10(17)18)11-7(13)4-6(12)5-8(11)14/h4-5,17H,2-3H2,1H3
charge 0 multiplicity 1
28 atoms
I  0.990232 3.075281 0.295876
I  1.077279 -3.098638 0.695382
I  6.053151 -0.0446 -1.157666
O  -0.775853 -0.084391 -1.361326
O  -5.839254 0.346027 -1.285756
O  -5.221683 -0.996914 0.50231
N  -0.053638 -0.014752 0.847001
C  -2.502209 -0.000991 0.387323
C  1.313306 -0.01625 0.399574
C  -1.061728 -0.029899 -0.129024
C  -3.494211 0.253759 -0.758732
C  -0.312313 0.037664 2.304557
C  1.998475 1.190455 0.093606
C  2.037876 -1.23057 0.255422
C  3.339134 1.200008 -0.348405
C  3.380012 -1.256248 -0.181394
C  4.014606 -0.032014 -0.481569
C  -4.892661 -0.20808 -0.413235
H  -2.615682 0.762899 1.178583
H  -2.739986 -0.973947 0.863242
H  -3.153616 -0.289259 -1.662533
H  -3.523404 1.316663 -1.053472
H  -0.533048 1.068182 2.643188
H  0.581498 -0.322454 2.839103
H  -1.152402 -0.622262 2.575388
H  3.839678 2.141537 -0.582036
H  3.910813 -2.20409 -0.288103
H  -6.741172 -0.010118 -1.058604
