program: Gaussian 09
title: 000205903
version: EM64L-G09RevD.01
frameworkgroup: C1[X(C15H10F3NO4)]
method: RPBEPBE
basis: SDD
operation: Freq
keyword: #p
keyword: freq=noraman
keyword: PBEPBE/SDD
title: #p freq=noraman PBEPBE/SDD
converged: YES YES NO NO
title: Mulliken charges:
elementType: F F F O O O O N C C C C C C C C C C C C C C C H H H H H H H H H H
charge: -0.159990 -0.161886 -0.167294 -0.438338 -0.267042 -0.437746 -0.275735 -0.504304 0.334607 0.069793 0.312114 0.331813 -0.476400 -0.287112 -0.413511 0.064253 -0.371367 0.242305 -0.297649 -0.220429 0.129540 -0.246984 0.126583 0.433420 0.307701 0.285537 0.272249 0.281336 0.279073 0.237279 0.239124 0.391012 0.388047
chargesum: 0.00000
title: Mulliken charges with hydrogens summed into heavy atoms:
elementType: F F F O O O O N C C C C C C C C C C C C C C C
charge: -0.159990 -0.161886 -0.167294 -0.047326 -0.267042 -0.049699 -0.275735 -0.070883 0.334607 0.069793 0.312114 0.331813 -0.168699 -0.001574 -0.141262 0.064253 -0.090031 0.242305 -0.018576 0.016850 0.129540 -0.007860 0.126583
polarizability: 2.80809845e+02 3.63023336e+01 2.39957773e+02 -1.34414979e+01 1.64000402e+01 1.05679005e+02
1716.lowfreq: -16.0885 -3.5679 -2.0240 -0.0005 -0.0003 0.0003 5.2500 30.8151 39.6003
frequency: -16.0504 30.8022 39.5863 54.4846 67.1577 80.3961 90.6190 117.4809 142.7453 161.3461 181.4445 190.2192 244.3286 253.0323 259.9447 300.7943 310.8391 333.7705 368.8800 393.6916 422.5586 437.7479 455.6529 480.4505 485.4480 512.1404 521.3812 537.4069 576.3522 584.4580 586.6338 595.9226 604.0987 627.8021 644.9388 673.4041 682.4073 688.2497 730.1249 735.2388 747.4172 772.1908 780.6859 787.6405 842.2140 845.5217 871.6893 913.7403 916.8040 978.3163 982.6706 987.3314 997.2449 1001.2571 1005.0110 1023.0501 1047.1211 1066.9080 1113.3974 1125.5057 1165.8546 1173.7576 1181.1345 1214.9378 1246.9755 1266.8684 1311.3148 1318.9374 1328.5541 1333.3459 1377.9077 1395.0903 1431.5016 1439.2752 1457.6401 1487.9653 1523.1420 1569.8743 1588.4127 1600.6262 1610.3346 1634.8510 1644.8692 3139.1585 3159.4384 3169.6012 3175.3837 3175.9275 3184.7278 3193.9351 3246.8358 3531.4085 3532.8643
redmass: 17.3667 7.6810 7.1026 7.5477 8.4526 12.6571 7.0040 6.6482 6.1901 7.2547 6.3754 8.2498 6.6797 6.3932 8.7926 8.0551 6.0762 7.2429 9.4459 8.7571 3.3536 4.5665 8.3469 7.9285 5.2169 4.7558 4.5921 6.7500 1.5695 1.9798 1.8819 3.6259 6.1872 4.8636 5.6203 7.4723 3.4922 4.2947 2.6798 2.3898 3.2728 2.3691 1.9504 4.0474 2.9721 1.9075 1.5016 1.8460 2.9811 1.3653 1.9393 3.2096 1.3784 4.9900 5.2955 6.7208 2.2860 3.4036 1.9142 1.8552 1.6774 1.6024 1.0760 2.2080 1.5678 2.5621 1.6026 2.0569 2.7362 2.8032 7.9861 10.4775 4.2577 2.6370 2.4942 2.6872 2.9213 7.5271 3.8301 5.9898 6.8264 6.4296 3.9506 1.0869 1.0904 1.0945 1.0887 1.0924 1.0983 1.0974 1.0793 1.0642 1.0642
irintensity: 0.0568 0.1650 1.5622 0.7647 0.4359 0.1374 0.3158 0.5095 1.0264 1.3287 1.2714 2.0228 3.5730 5.9691 1.3696 0.0511 2.1589 5.6370 8.5071 10.2438 15.9998 4.1547 28.3122 27.4109 9.4749 14.7611 10.0979 8.6166 51.0601 26.5133 97.0517 51.7423 46.1325 11.5453 11.3104 15.3358 79.6981 5.4856 15.0808 9.2789 35.5957 143.9485 3.9315 31.5631 7.7699 53.5751 12.7762 37.8744 46.9235 0.2664 67.4501 140.6114 34.5688 496.9145 265.2196 28.2576 18.2457 65.4553 121.5532 260.3328 111.1506 50.6681 1.1813 90.5368 46.4603 195.5245 22.5086 105.0304 171.9063 144.0217 9.5528 3.1284 207.7835 2.9486 122.3810 39.1334 292.9048 109.1351 608.0147 2.1775 37.7624 159.4884 70.5847 4.7082 12.8550 5.0858 0.4372 1.5474 9.0254 0.0606 164.0726 61.8613 76.3087
temp: 298.150 k
press: 1.00000 atm
elementType: 9 9 9 8 8 8 8 7 6 6 6 6 6 6 6 6 6 6 6 6 6 6 6 1 1 1 1 1 1 1 1 1 1
symmnumber: 1
zpe: 591087.7 jmol-1
zpe.correction: 0.225133 hartree
zpe.thermalcorrener: 0.244112 hartree
zpe.thermalcorrenthalpy: 0.245056 hartree
zpe.thermalcorrgfe: 0.176879 hartree
zpe.sumelectzpe: -1231.191037 hartree
zpe.sumelectthermal: -1231.172058 hartree
zpe.sumelectthermalent: -1231.171114 hartree
zpe.sumelectthermalfe: -1231.239292 hartree
dipole: -1.9650 1.1195 -1.1938
dipole: 2.5573
quadrupole: -127.2372 -119.8047 -130.5132
quadrupole: 15.2452 -5.0874 3.7820
quadrupole: -1.3855 6.0470 -4.6615 15.2452 -5.0874 3.7820
hfenergy: -1231.4161704 hartree
pointgroup: C01 [X(C15H10F3N1O4)]
dipole: 0.751853 -0.5098431 -0.4325085 debye
polarizability: 285.1059692|33.835866|233.7120954|16.7220107|-19.966176|107.6285578 unknown
InChI: InChI=1S/C15H10F3NO4/c16-15(17,18)8-5-6-10(14(22)23)12(7-8)19-11-4-2-1-3-9(11)13(20)21/h1-7,19-20,22H
charge 0 multiplicity 1
33 atoms
F  -4.818396 1.664835 0.220508
F  -3.141643 2.383866 1.567928
F  -3.050001 2.783103 -0.656925
O  -1.38058 -4.266958 -0.665189
O  0.712988 -3.363753 -0.261469
O  4.798398 -0.31759 1.645495
O  2.991314 -1.711173 1.261932
N  0.876343 -0.649374 -0.07929
C  -0.521635 -0.664692 -0.091097
C  -1.248748 -1.906378 -0.22683
C  1.721391 0.446747 -0.346613
C  -2.685613 0.498289 0.093944
C  -1.281344 0.52826 0.09306
C  -2.668831 -1.899729 -0.219576
C  -3.400753 -0.712837 -0.073587
C  3.05634 0.489018 0.195338
C  1.315391 1.507461 -1.209117
C  -3.416923 1.797147 0.30213
C  3.904623 1.591002 -0.104294
C  2.173849 2.583157 -1.492378
C  -0.531433 -3.189997 -0.375217
C  3.474214 2.640578 -0.931211
C  3.560729 -0.603985 1.051219
H  1.346328 -1.541279 0.173253
H  -0.762894 1.472176 0.276827
H  -3.184579 -2.855966 -0.334223
H  -4.492909 -0.718834 -0.07787
H  0.337032 1.462978 -1.694463
H  4.908437 1.595816 0.328227
H  1.831685 3.373844 -2.169068
H  4.138917 3.481047 -1.151865
H  -0.829615 -5.092107 -0.733273
H  5.075618 -1.10637 2.184197
