program: Gaussian 09
title: 000015419
version: EM64L-G09RevD.01
frameworkgroup: C1[X(C10H13N5O)]
method: RPBEPBE
basis: SDD
operation: Freq
keyword: #p
keyword: freq=noraman
keyword: PBEPBE/SDD
title: #p freq=noraman PBEPBE/SDD
converged: YES YES NO NO
title: Mulliken charges:
elementType: O N N N N N C C C C C C C C C C H H H H H H H H H H H H H
charge: -0.461707 -0.375251 -0.401332 -0.082745 -0.024126 0.025539 0.092634 -0.431647 0.233821 -0.334144 -0.085318 0.416020 -0.456010 -0.224772 -0.791498 -0.386047 0.279603 0.222758 0.281087 0.239758 0.302939 0.190079 0.211978 0.262974 0.271300 0.212526 0.218088 0.244115 0.349379
chargesum: 0.00000
title: Mulliken charges with hydrogens summed into heavy atoms:
elementType: O N N N N N C C C C C C C C C C
charge: -0.112327 -0.094165 -0.098393 -0.082745 -0.024126 0.025539 0.092634 0.070713 0.233821 -0.094386 -0.085318 0.416020 -0.053953 0.038202 -0.089585 -0.141932
polarizability: 2.31567263e+02 3.92797940e+00 1.44956064e+02 -1.45259777e+01 -2.23892437e+00 8.95832514e+01
1716.lowfreq: -5.0605 -4.4414 -0.0003 0.0001 0.0005 8.1172 15.3531 28.3232 36.9691
frequency: 15.3132 28.2364 36.9308 77.2008 111.5214 131.0905 154.4163 165.4726 200.6045 210.5206 225.7720 269.3248 296.1224 308.9909 385.6184 427.8542 452.2625 480.3740 517.0489 533.0067 554.4167 563.2447 577.5303 612.1068 640.0415 670.6424 715.8482 782.6492 787.2232 827.9195 836.5456 870.1537 903.7814 930.2897 947.2044 953.0808 963.6856 980.2707 1018.9683 1046.9620 1071.4938 1093.9820 1116.0825 1124.5791 1167.5476 1202.9666 1214.5415 1232.1235 1256.5915 1280.0950 1302.8176 1317.4602 1331.3635 1335.8984 1365.5076 1377.3252 1391.1599 1402.7957 1424.7557 1427.0623 1455.7461 1465.4914 1468.4575 1477.5394 1484.2041 1520.4122 1608.8075 1690.8981 2916.2130 2976.6356 2991.6190 2999.1288 3056.0031 3057.8126 3092.0290 3099.7034 3162.3435 3232.9230 3569.0120 3569.4433 3586.1790
redmass: 4.8931 3.8443 4.5051 3.8681 4.1289 1.1927 4.2811 3.3664 2.9520 1.3192 4.8928 3.5479 5.7556 2.2646 2.6260 1.2056 3.6796 3.5113 3.4556 8.3389 1.5358 3.8201 3.2777 2.4435 6.3765 7.0945 4.9555 2.5150 5.5419 1.6345 5.8539 1.7017 7.5352 1.4275 4.7637 1.5899 3.2243 2.4415 1.7516 1.6470 2.0324 3.5623 2.9040 2.9236 1.4452 1.1385 1.2257 2.1646 1.5156 4.7486 4.8951 1.4140 2.2690 2.7320 1.6499 1.9092 1.3909 1.3072 2.9383 1.9806 1.0614 1.0903 1.0773 1.9908 1.1529 7.4876 6.7654 6.8264 1.0605 1.0400 1.0998 1.0602 1.0997 1.0938 1.0904 1.0986 1.0918 1.0987 1.0667 1.0771 1.0819
irintensity: 3.3221 1.5254 0.2251 2.4513 2.9574 0.8107 2.3836 20.0843 38.9892 104.1262 5.5809 8.3078 2.7186 1.2907 5.4971 52.1388 13.9410 7.9592 3.9914 5.2439 152.1556 22.5564 9.7635 5.4847 15.9846 2.6142 5.8419 7.1427 0.5690 23.5526 27.6495 51.6083 1.2688 12.8724 105.4057 3.3997 8.4546 3.0072 35.3939 2.2844 40.8404 23.7050 32.0509 7.2751 24.6448 12.1855 43.2066 37.5536 13.8656 3.3598 44.8913 15.4013 6.4995 82.6689 49.1172 57.8685 32.2172 9.7520 86.4468 3.4898 8.9016 2.5415 10.2205 34.8562 29.3398 196.5371 538.9031 2.0309 66.4130 23.5425 47.8787 65.7306 5.1705 22.1456 14.2277 34.3862 22.4875 1.5223 2.2400 37.8569 37.3700
temp: 298.150 k
press: 1.00000 atm
elementType: 8 7 7 7 7 7 6 6 6 6 6 6 6 6 6 6 1 1 1 1 1 1 1 1 1 1 1 1 1
symmnumber: 1
zpe: 598892.4 jmol-1
zpe.correction: 0.228106 hartree
zpe.thermalcorrener: 0.243537 hartree
zpe.thermalcorrenthalpy: 0.244481 hartree
zpe.thermalcorrgfe: 0.182854 hartree
zpe.sumelectzpe: -736.631671 hartree
zpe.sumelectthermal: -736.616241 hartree
zpe.sumelectthermalent: -736.615297 hartree
zpe.sumelectthermalfe: -736.676924 hartree
dipole: -6.1985 -7.1279 0.5407
dipole: 9.4616
quadrupole: -119.1672 -83.9903 -91.5809
quadrupole: -3.9706 10.5600 0.6834
quadrupole: -20.9211 14.2559 6.6652 -3.9706 10.5600 0.6834
hfenergy: -736.8597776 hartree
pointgroup: C01 [X(C10H13N5O1)]
dipole: 2.4798221 -2.6740505 -0.7460946 debye
polarizability: 228.7481721|1.4199388|143.451547|-24.9929937|8.5966787|93.9068599 unknown
InChI: InChI=1S/C10H13N5O/c1-7(4-16)2-3-11-9-8-10(13-5-12-8)15-6-14-9/h2,5-6,11-12,16H,3-4H2,1H3
charge 0 multiplicity 1
29 atoms
O  6.067238 0.218299 0.601619
N  0.22752 -0.15334 -0.454816
N  -2.411367 -1.920547 -0.049949
N  -1.158068 1.615859 0.299727
N  -4.364213 -0.990261 0.701726
N  -3.518173 1.33667 0.926861
C  -2.139436 -0.557698 0.148941
C  1.409713 0.724852 -0.606801
C  -1.003542 0.291545 -0.008968
C  2.58016 0.216285 0.206708
C  -3.369275 0.00763 0.617591
C  3.822999 -0.114539 -0.249042
C  4.862713 -0.630421 0.728718
C  -3.75535 -2.113677 0.297181
C  4.302678 -0.01378 -1.682537
C  -2.382079 2.056154 0.74147
H  1.085536 1.719481 -0.250649
H  1.667619 0.822732 -1.677401
H  0.360134 -1.146834 -0.642313
H  2.374725 0.128332 1.284165
H  -1.776845 -2.642831 -0.386513
H  5.119537 -1.684808 0.475365
H  4.464604 -0.600107 1.763822
H  -4.231908 -3.090151 0.235343
H  5.122239 0.724649 -1.742602
H  4.727559 -0.979771 -2.020078
H  3.51082 0.283977 -2.388516
H  -2.438191 3.124477 0.97127
H  6.810053 -0.189979 1.113578
