program: Gaussian 09
title: 000205886
version: EM64L-G09RevD.01
frameworkgroup: C1[X(C16H24N2O)]
method: RPBEPBE
basis: SDD
operation: Freq
keyword: #p
keyword: freq=noraman
keyword: PBEPBE/SDD
title: #p freq=noraman PBEPBE/SDD
converged: YES YES NO NO
title: Mulliken charges:
elementType: O N N C C C C C C C C C C C C C C C C H H H H H H H H H H H H H H H H H H H H H H H H
charge: -0.293270 -0.085506 -0.125086 -0.337054 -0.352632 -0.408181 -0.393322 -0.339815 -0.443404 -0.541036 0.255513 -0.489711 0.505294 -0.673896 -0.406449 -0.421973 -0.229707 -0.225685 -0.244720 0.187094 0.214141 0.215311 0.192898 0.221632 0.227434 0.259426 0.219174 0.195015 0.202813 0.218560 0.222076 0.234193 0.195826 0.226895 0.222647 0.201558 0.231380 0.232646 0.229456 0.228824 0.222769 0.222186 0.226686
chargesum: 0.00000
title: Mulliken charges with hydrogens summed into heavy atoms:
elementType: O N N C C C C C C C C C C C C C C C C
charge: -0.293270 -0.085506 -0.125086 0.064181 0.055576 0.040884 0.085278 0.058013 -0.002767 -0.111017 0.255513 -0.040168 0.505294 -0.008312 -0.176993 -0.193149 -0.006938 -0.003499 -0.018034
polarizability: 2.56171920e+02 -2.21315667e+00 1.82712169e+02 -5.24316112e+00 1.83170423e+00 1.23305826e+02
1716.lowfreq: -6.6953 -2.4733 0.0003 0.0009 0.0013 7.8691 12.9742 18.9986 26.4126
frequency: 11.8540 17.8302 24.1518 32.5669 52.4433 66.9619 90.8504 111.3695 136.4649 163.6299 201.8543 226.8013 248.4753 264.6467 290.2587 313.3632 324.4048 331.7839 339.3548 403.7801 409.8743 460.3139 465.7844 486.0785 498.7507 541.4260 557.2739 598.3331 616.2335 617.8495 705.9011 722.2138 725.2131 754.0821 787.4610 809.9142 813.4215 840.4752 853.6070 877.0382 894.9472 917.4581 944.2259 957.0190 975.1154 989.8431 992.7781 1002.9266 1015.9867 1026.0578 1034.7485 1048.6180 1053.8236 1067.5532 1072.9621 1082.5563 1091.0216 1105.8471 1124.2486 1137.7865 1169.5277 1171.3104 1185.4647 1197.9194 1210.9040 1214.7253 1219.8794 1247.0482 1253.9390 1268.9468 1277.5153 1288.4093 1301.7832 1313.1107 1325.0594 1329.4217 1338.8959 1346.9873 1358.8478 1364.9702 1381.0384 1387.4878 1395.1348 1417.5023 1438.7847 1449.4941 1457.6479 1459.9160 1462.8398 1465.5188 1467.3188 1471.6280 1477.8086 1479.3156 1483.3958 1486.1231 1586.4731 1591.6478 1614.1265 2839.2769 2845.6726 2865.9613 2968.1663 2969.9281 2980.8138 2981.2865 2989.0532 2997.8838 3006.4327 3018.5546 3030.1393 3035.7396 3042.9809 3057.8690 3090.4711 3093.6061 3100.3880 3107.8184 3111.5839 3111.8780 3129.5315 3140.9821 3160.5453
redmass: 4.2922 3.7996 4.0503 3.6297 3.9218 3.6106 4.4438 1.8389 3.0001 3.2162 1.2627 2.5976 2.6504 2.9037 2.5550 2.8835 2.6777 2.4687 2.9910 2.8236 1.9388 2.8567 3.8879 3.6236 3.1236 2.6182 3.4996 3.6520 2.4093 6.2892 1.7447 2.7685 2.4424 2.0228 1.6352 1.3537 2.3999 1.5676 1.2497 2.0457 3.0726 1.4797 2.0056 2.4224 1.3869 6.1585 1.3158 1.9286 1.9292 2.1901 1.9431 2.0453 1.7441 2.3171 1.6286 2.3741 1.7434 2.3957 1.7483 2.7143 1.8189 1.1217 1.1132 1.0780 1.5192 2.0245 2.2516 1.8231 1.1830 1.3532 1.3491 1.3183 1.4031 1.5767 1.2607 1.3222 1.2804 1.4432 1.3447 1.3849 7.9422 1.4777 1.2189 2.6162 2.1821 1.1137 1.0821 1.0841 1.0861 1.0570 1.0911 1.1037 1.1091 1.0566 2.2387 1.0978 7.4330 6.0431 6.1941 1.0714 1.0701 1.0695 1.0598 1.0687 1.0665 1.0614 1.0618 1.0369 1.0883 1.0999 1.0965 1.0895 1.0887 1.1020 1.0956 1.0996 1.0921 1.1002 1.0880 1.0860 1.0904 1.0957 1.1014
irintensity: 0.2405 0.0949 2.0347 0.9582 0.3404 1.1867 0.4293 2.4989 1.2944 1.1904 0.7128 0.3881 2.3773 1.5642 4.0696 2.0215 7.9426 0.4046 14.6617 0.0040 0.2469 0.2338 2.2757 0.9364 13.6352 1.9145 11.2972 4.3539 2.7685 0.1313 51.9069 2.9212 4.1724 42.3055 7.7810 15.7888 1.2943 0.2828 0.0059 2.5650 2.3036 1.7952 2.4328 12.6186 0.0117 0.0042 0.3109 50.4020 27.9995 10.8660 17.4787 4.1614 1.1957 3.1302 0.2756 4.0162 13.0886 2.6288 6.3228 59.7785 12.3829 2.7348 0.2871 3.2370 168.4804 4.5322 19.4328 14.5761 0.4753 19.0030 14.5006 14.1318 8.1907 15.4764 0.9333 17.5967 3.2283 16.3635 3.5534 3.3400 0.6199 6.4849 18.5605 132.3855 7.0753 36.5615 0.8074 16.0549 3.5807 19.6050 2.1840 3.9275 9.6264 16.9852 24.7849 16.1266 286.8673 1.5398 12.4709 34.1902 82.5932 163.8006 23.4484 49.7655 46.3366 6.3466 47.8195 35.6989 18.6291 15.2033 8.9513 58.6542 42.3212 47.2197 6.2507 26.6035 21.7465 30.6036 6.6129 15.3621 10.1624 48.5448 26.0307
temp: 298.150 k
press: 1.00000 atm
elementType: 8 7 7 6 6 6 6 6 6 6 6 6 6 6 6 6 6 6 6 1 1 1 1 1 1 1 1 1 1 1 1 1 1 1 1 1 1 1 1 1 1 1 1
symmnumber: 1
zpe: 977134.0 jmol-1
zpe.correction: 0.372171 hartree
zpe.thermalcorrener: 0.391286 hartree
zpe.thermalcorrenthalpy: 0.392230 hartree
zpe.thermalcorrgfe: 0.320634 hartree
zpe.sumelectzpe: -807.367509 hartree
zpe.sumelectthermal: -807.348394 hartree
zpe.sumelectthermalent: -807.347450 hartree
zpe.sumelectthermalfe: -807.419046 hartree
dipole: -2.9808 1.2086 1.6680
dipole: 3.6233
quadrupole: -141.3962 -105.3864 -118.5812
quadrupole: 11.0774 4.0042 -0.5777
quadrupole: -19.6083 16.4015 3.2067 11.0774 4.0042 -0.5777
hfenergy: -807.7396801 hartree
pointgroup: C01 [X(C16H24N2O1)]
dipole: 1.1845953 -0.4345783 0.663268 debye
polarizability: 256.2705442|-0.6200102|182.5212843|4.7744818|-3.2821461|123.3980869 unknown
InChI: InChI=1S/C16H24N2O/c1-2-16(19)18-13-11-17(12-14-18)10-6-9-15-7-4-3-5-8-15/h3-5,7-8H,2,6,9-14H2,1H3
charge 0 multiplicity 1
43 atoms
O  -5.515401 0.494057 -0.608134
N  -0.681896 1.089008 0.144248
N  -3.26651 -0.0604 -0.431743
C  -1.13608 -0.140437 0.837898
C  -1.845398 1.95348 -0.188229
C  -2.136586 -0.922625 -0.041541
C  -2.847582 1.199836 -1.081096
C  0.360317 1.83164 0.899959
C  1.717878 1.101688 0.974533
C  2.334087 0.819347 -0.422862
C  -4.620657 -0.332423 -0.241164
C  -4.984077 -1.671837 0.426829
C  3.673263 0.10533 -0.326144
C  -6.507499 -1.861173 0.540034
C  4.877224 0.838626 -0.157233
C  3.749586 -1.311559 -0.35861
C  6.119389 0.178961 -0.021822
C  4.989023 -1.977631 -0.222769
C  6.179785 -1.233909 -0.052463
H  -1.622049 0.100879 1.819639
H  -0.264323 -0.787021 1.042972
H  -1.477963 2.845135 -0.728938
H  -2.374499 2.303926 0.734581
H  -1.607443 -1.268539 -0.953644
H  -2.496385 -1.806569 0.505897
H  -3.754571 1.799549 -1.26037
H  -2.367384 0.967265 -2.052913
H  0.015272 2.069183 1.939908
H  0.508049 2.800524 0.38322
H  1.624932 0.150831 1.534864
H  2.413842 1.731441 1.563487
H  1.608019 0.225521 -1.007836
H  2.453018 1.7855 -0.952709
H  -4.540435 -2.504995 -0.154652
H  -4.52302 -1.715795 1.434461
H  -6.740346 -2.823657 1.030974
H  -6.980099 -1.846029 -0.456263
H  -6.961341 -1.043575 1.124324
H  4.839405 1.935553 -0.139012
H  2.830666 -1.894949 -0.499925
H  7.038308 0.763566 0.102465
H  5.027668 -3.072696 -0.255066
H  7.142216 -1.747932 0.049648
