program: Gaussian 09
title: 000205871
version: EM64L-G09RevD.01
frameworkgroup: C1[X(C16H30N2O2)]
method: RPBEPBE
basis: SDD
operation: Freq
keyword: #p
keyword: freq=noraman
keyword: PBEPBE/SDD
title: #p freq=noraman PBEPBE/SDD
converged: YES YES NO NO
title: Mulliken charges:
elementType: O O N N C C C C C C C C C C C C C C C C H H H H H H H H H H H H H H H H H H H H H H H H H H H H H H
charge: -0.284281 -0.284290 -0.137312 -0.137305 -0.383354 -0.377898 -0.377898 -0.383307 0.242141 0.242126 -0.531718 -0.531730 -0.371055 -0.371059 -0.339147 -0.339151 -0.355677 -0.355673 -0.695911 -0.695914 0.232227 0.237732 0.267715 0.219340 0.219352 0.267725 0.237720 0.232228 0.228763 0.225596 0.228803 0.225565 0.214869 0.216501 0.216498 0.214875 0.180454 0.180629 0.180628 0.180457 0.197964 0.197986 0.197962 0.197987 0.208690 0.217208 0.208518 0.208519 0.217208 0.208690
chargesum: 0.00000
title: Mulliken charges with hydrogens summed into heavy atoms:
elementType: O O N N C C C C C C C C C C C C C C C C
charge: -0.284281 -0.284290 -0.137312 -0.137305 0.086605 0.109156 0.109180 0.086641 0.242141 0.242126 -0.077359 -0.077363 0.060316 0.060315 0.021937 0.021934 0.040273 0.040277 -0.061494 -0.061496
polarizability: 2.75556866e+02 -6.82160353e+00 1.76662070e+02 5.04278477e+00 -4.12914950e+00 1.41652891e+02
1716.lowfreq: -7.8223 -0.0012 -0.0012 0.0014 2.1577 11.0630 13.1178 30.0832 38.5856
frequency: 13.1172 30.0832 38.2110 48.4834 51.4437 54.8001 63.2460 70.3521 76.9904 96.3536 119.7123 126.7261 126.8126 145.3487 152.1999 190.0616 207.9775 227.3931 229.3800 229.5199 246.1048 294.2530 314.3114 339.2127 369.6085 403.1891 404.0408 415.3038 453.3240 472.4589 520.2468 522.2582 552.5800 555.8614 607.5459 630.2076 723.9174 723.9943 751.1442 758.0356 758.3614 758.4983 837.4299 847.3502 848.4689 887.3464 893.8049 916.6487 917.9857 955.4193 955.5987 979.0919 1003.3880 1010.1527 1027.7441 1035.6075 1047.5986 1066.6291 1071.0787 1076.4957 1077.1143 1094.4795 1098.9560 1102.9953 1115.8145 1121.7259 1157.3718 1197.3442 1197.9138 1198.0974 1201.0920 1213.0235 1228.9650 1240.4276 1248.4999 1258.1748 1258.5440 1275.4095 1283.0392 1283.1090 1293.8231 1294.0071 1298.8151 1301.0077 1330.4194 1339.9621 1344.7637 1345.9944 1355.5044 1356.8582 1358.6299 1358.9372 1391.3466 1391.3477 1410.9300 1413.6563 1445.7487 1446.3149 1460.9073 1463.0981 1463.1277 1463.5292 1467.3354 1468.9320 1469.3944 1469.9777 1477.0252 1477.0434 1478.8861 1478.8962 1488.0333 1488.0531 1581.4619 1583.1118 2947.7408 2947.7540 2959.4466 2959.5273 2964.3572 2966.7630 2970.0214 2970.0396 2971.7707 2971.8013 2976.6479 2980.2329 2989.6486 2989.6616 3001.7042 3001.7151 3007.6765 3007.6816 3023.6648 3023.6721 3062.9760 3062.9971 3068.8927 3068.9478 3071.5961 3071.6070 3084.4014 3084.5667 3103.6793 3103.9533
redmass: 4.3350 3.7230 3.2428 4.0696 2.0624 1.8462 3.2254 4.7816 3.6234 2.8979 3.0199 1.8276 1.8941 2.2840 2.5049 3.3210 3.7940 3.4243 1.1349 1.1321 3.3640 2.6962 6.4534 2.3203 3.7837 2.0964 3.3393 3.0215 2.6057 3.4970 3.9061 3.5512 3.1003 2.8488 5.3741 2.0385 1.0779 1.0775 4.4991 1.8094 1.1974 1.8202 1.5505 1.3166 1.3387 2.2800 1.9705 2.6373 2.5993 1.2626 1.2600 2.5924 3.2124 3.7662 3.0097 2.5670 1.7484 2.8122 2.5265 2.2117 2.3025 1.7262 1.4252 1.6938 2.4408 2.5294 3.3118 1.4785 1.5626 1.5379 1.2424 1.5304 2.9406 1.3719 1.6211 1.2641 1.2593 1.5736 1.0412 1.0444 1.1415 1.1321 1.4144 1.3643 1.2752 1.3024 1.5287 1.4397 1.5289 1.5786 1.4686 1.4721 1.2181 1.2182 2.5555 2.7170 1.1098 1.0995 1.0829 1.0729 1.0732 1.0787 1.1096 1.0803 1.0773 1.0956 1.0438 1.0438 1.0680 1.0680 1.0875 1.0876 7.7537 8.2177 1.0590 1.0590 1.0594 1.0594 1.0694 1.0696 1.0552 1.0552 1.0404 1.0404 1.0672 1.0676 1.0988 1.0988 1.0605 1.0604 1.0989 1.0989 1.1029 1.1029 1.1029 1.1029 1.1014 1.1014 1.0992 1.0992 1.0951 1.0953 1.0927 1.0926
irintensity: 0.0280 0.1266 0.0000 3.6400 0.0013 1.4798 0.0000 0.0000 5.2868 0.0000 4.3921 0.1144 0.7949 2.9438 0.0000 0.0000 0.0000 10.1199 0.1344 0.0905 1.0967 12.5520 0.0000 8.9125 0.0000 0.0004 15.4088 0.0000 0.0000 1.0104 0.0000 25.0186 15.2878 0.0001 0.0000 5.1108 0.0453 24.6845 0.0000 0.2530 0.0002 0.1425 0.0000 11.0097 0.0001 0.0000 13.1537 0.0000 2.5878 0.0568 0.0004 27.2271 124.0238 0.0000 20.6738 0.0000 10.1614 0.0000 2.2370 0.0003 1.9557 0.0000 0.4009 0.0000 5.0257 0.0000 8.4481 0.0073 24.9872 330.8445 0.0011 0.0001 0.0001 95.3937 0.0005 0.3894 0.0010 50.8505 0.0570 0.7515 1.2673 0.0042 0.0024 29.0454 0.0000 5.5690 0.0002 1.2677 0.0003 18.4758 6.8487 0.0034 14.4369 8.4299 0.0026 318.5182 53.7334 0.0088 31.0958 0.8400 0.0018 0.0003 15.3779 0.0004 5.1564 0.0015 10.9098 13.7463 0.2452 8.7834 0.1538 39.5582 528.5586 0.0021 14.8568 16.2281 0.0483 49.6198 38.2157 0.0001 2.6020 122.8427 52.3491 0.6500 0.0002 131.9304 3.8083 12.1933 2.0242 54.5898 5.7826 14.6689 6.7981 28.2239 0.0632 7.8827 0.1320 264.6614 108.6746 3.4417 16.3381 0.0002 37.7175 0.0444
temp: 298.150 k
press: 1.00000 atm
elementType: 8 8 7 7 6 6 6 6 6 6 6 6 6 6 6 6 6 6 6 6 1 1 1 1 1 1 1 1 1 1 1 1 1 1 1 1 1 1 1 1 1 1 1 1 1 1 1 1 1 1
symmnumber: 1
zpe: 1159029.7 jmol-1
zpe.correction: 0.441451 hartree
zpe.thermalcorrener: 0.465094 hartree
zpe.thermalcorrenthalpy: 0.466038 hartree
zpe.thermalcorrgfe: 0.385013 hartree
zpe.sumelectzpe: -886.060615 hartree
zpe.sumelectthermal: -886.036973 hartree
zpe.sumelectthermalent: -886.036029 hartree
zpe.sumelectthermalfe: -886.117053 hartree
dipole: -0.0002 0.0002 0.0013
dipole: 0.0013
quadrupole: -128.1294 -138.8549 -121.5196
quadrupole: 20.8602 -2.1128 0.9600
quadrupole: 1.3719 -9.3536 7.9817 20.8602 -2.1128 0.9600
hfenergy: -886.5020664 hartree
pointgroup: C01 [X(C16H30N2O2)]
dipole: -0.0000684 -0.0001065 -0.0005057 debye
polarizability: 275.6462909|5.6964723|176.2874828|-5.6637598|-5.0508086|141.9380535 unknown
InChI: InChI=1S/C16H30N2O2/c1-3-5-7-9-15(19)17-11-13-18(14-12-17)16(20)10-8-6-4-2/h3-14H2,1-2H3
charge 0 multiplicity 1
50 atoms
O  -2.828232 -2.124001 0.169249
O  2.833538 2.133332 -0.110623
N  -1.308358 -0.439747 -0.325412
N  1.313462 0.448736 0.382222
C  -0.910147 0.954593 -0.607113
C  -0.185896 -1.400079 -0.323184
C  0.191007 1.409071 0.380046
C  0.915243 -0.945588 0.663987
C  -2.606734 -0.897245 -0.083474
C  2.611852 0.906264 0.140413
C  -3.742663 0.1366 -0.141051
C  3.747984 -0.12727 0.199538
C  -5.128074 -0.505354 0.071971
C  5.133517 0.515116 -0.011369
C  -6.272587 0.528675 -0.002189
C  6.278244 -0.518555 0.06444
C  -7.667872 -0.103861 0.205693
C  7.673638 0.114447 -0.141281
C  -8.815538 0.925587 0.125845
C  8.821527 -0.914614 -0.059684
H  -0.517214 1.025868 -1.642297
H  -1.777989 1.62538 -0.522399
H  -0.592971 -2.384024 -0.037658
H  0.242014 -1.46866 -1.34452
H  -0.236891 1.47763 1.401389
H  0.59808 2.393018 0.094522
H  1.783083 -1.616385 0.579333
H  0.522273 -1.016824 1.69916
H  -3.720134 0.657926 -1.120226
H  -3.573591 0.917785 0.629058
H  3.72419 -0.648767 1.178597
H  3.580239 -0.908368 -0.570944
H  -5.281803 -1.296471 -0.68592
H  -5.143241 -1.020989 1.050421
H  5.149985 1.030831 -0.989756
H  5.285869 1.306224 0.746809
H  -6.115087 1.318792 0.762733
H  -6.250575 1.041373 -0.987541
H  6.25491 -1.031333 1.04972
H  6.122155 -1.308666 -0.700778
H  -7.692757 -0.612562 1.190781
H  -7.824207 -0.895261 -0.555231
H  7.699867 0.623182 -1.126318
H  7.828537 0.90588 0.619902
H  -8.83396 1.424372 -0.861826
H  -9.800043 0.446987 0.280367
H  -8.697685 1.711863 0.895589
H  8.705126 -1.700923 -0.829616
H  9.806106 -0.435679 -0.212684
H  8.838601 -1.413405 0.928009
