program: Gaussian 09
title: 000205870
version: EM64L-G09RevD.01
frameworkgroup: C1[X(C14H26N2O2)]
method: RPBEPBE
basis: SDD
operation: Freq
keyword: #p
keyword: freq=noraman
keyword: PBEPBE/SDD
title: #p freq=noraman PBEPBE/SDD
converged: YES YES NO NO
title: Mulliken charges:
elementType: O O N N C C C C C C C C C C C C C C H H H H H H H H H H H H H H H H H H H H H H H H H H
charge: -0.284734 -0.284735 -0.136989 -0.136989 -0.383615 -0.378454 -0.378451 -0.383612 0.243635 0.243636 -0.521771 -0.521773 -0.351041 -0.351040 -0.343781 -0.343782 -0.693705 -0.693705 0.232426 0.237438 0.267827 0.219709 0.219710 0.267827 0.237438 0.232426 0.226589 0.223048 0.223049 0.226589 0.215104 0.212341 0.212349 0.215095 0.188277 0.187729 0.188278 0.187728 0.214514 0.212671 0.212778 0.214514 0.212777 0.212672
chargesum: 0.00000
title: Mulliken charges with hydrogens summed into heavy atoms:
elementType: O O N N C C C C C C C C C C C C C C
charge: -0.284734 -0.284735 -0.136989 -0.136989 0.086249 0.109082 0.109086 0.086253 0.243635 0.243636 -0.072134 -0.072135 0.076404 0.076404 0.032225 0.032224 -0.053742 -0.053742
polarizability: 2.44051130e+02 -7.23207904e+00 1.56870371e+02 5.49233634e+00 -3.57542282e+00 1.24642073e+02
1716.lowfreq: -15.4489 -3.7615 -0.0013 -0.0009 0.0007 5.6311 7.4672 37.7182 41.2573
frequency: 5.6305 37.7179 41.1920 42.5218 45.4692 53.4418 74.0638 84.6043 87.8293 105.4619 137.9128 151.8236 154.2706 207.6652 241.6496 241.8080 262.7544 270.6826 285.8342 309.3665 332.9719 354.8617 391.9405 408.2236 454.5469 467.6036 517.1199 523.9895 552.9172 556.6859 605.8563 629.4456 725.4104 725.4722 748.7698 755.5767 799.7664 800.0303 838.4045 899.3360 900.2960 907.8782 917.8063 922.4526 922.5173 979.5007 1010.1763 1026.3871 1040.4275 1041.9881 1048.1592 1082.9297 1084.6715 1090.2754 1096.5691 1098.0625 1108.9567 1120.7621 1156.9859 1197.9333 1200.0092 1206.7488 1206.8236 1213.3721 1231.2910 1252.1568 1258.5504 1275.6532 1276.6472 1277.6453 1285.5903 1285.9478 1318.3069 1321.0621 1331.5076 1341.9715 1351.5347 1352.8428 1356.7794 1357.4233 1391.1271 1391.1398 1410.7321 1413.2711 1444.5893 1445.1241 1460.8114 1463.1163 1464.6699 1464.6955 1467.4258 1470.1161 1475.6078 1475.6141 1478.4693 1478.4719 1487.8635 1487.8819 1581.2773 1582.8427 2957.0810 2957.0819 2959.6953 2959.7842 2966.1439 2968.2948 2974.3997 2974.4503 2978.2874 2981.6417 3001.1806 3001.1951 3002.3130 3002.3217 3008.3658 3008.3712 3061.5159 3061.5351 3073.0998 3073.1017 3073.6062 3073.6525 3084.3200 3084.5025 3101.8308 3102.1135
redmass: 3.7064 1.6163 2.0493 3.8069 2.5381 6.4185 4.7358 4.0233 3.4086 2.7795 2.2285 2.8947 2.1925 3.4519 1.0920 1.0980 2.8023 3.7861 2.7992 3.4006 7.0290 2.5896 3.3106 2.0015 2.5925 3.4183 3.7947 3.4209 3.1354 2.8496 5.4822 2.0585 1.0970 1.0978 4.9639 4.0450 1.2702 1.2695 1.5858 1.8181 1.8233 3.5911 2.5835 1.3059 1.3545 2.6025 2.9419 3.2040 2.5788 2.6232 1.8037 2.4076 2.2115 1.8400 1.4633 1.5797 2.3834 2.4319 3.2941 1.5565 1.1749 1.4682 1.4910 1.5491 3.4516 1.3960 1.5271 1.3379 1.1641 1.3429 1.0714 1.0846 1.4600 1.4510 1.2867 1.2612 1.6666 1.6441 1.3843 1.3901 1.2146 1.2150 2.5566 2.7801 1.1080 1.0985 1.0805 1.0779 1.0727 1.0725 1.1205 1.1070 1.0696 1.0697 1.0420 1.0421 1.0767 1.0768 7.6521 8.1202 1.0593 1.0593 1.0589 1.0589 1.0691 1.0694 1.0359 1.0359 1.0670 1.0673 1.0835 1.0833 1.0757 1.0759 1.0999 1.0999 1.1027 1.1027 1.0997 1.0996 1.1011 1.1012 1.0953 1.0955 1.0934 1.0934
irintensity: 0.0015 0.5323 0.0001 0.3323 0.0000 6.2145 0.0000 0.0000 4.0972 0.0000 3.8626 8.3207 0.0001 0.0000 0.0185 0.0000 1.3850 0.0000 7.9283 12.3135 0.0000 17.4680 0.0000 0.0000 0.0000 3.0077 0.0000 21.9793 15.7988 0.0000 0.0000 5.3678 0.2753 22.7679 0.0000 1.3829 0.0000 0.5108 0.0000 29.9821 0.0001 0.0000 4.8662 0.0067 8.7390 25.5655 111.3927 0.0000 0.0000 2.6133 13.9607 0.0000 1.5206 0.0000 0.7441 0.0000 13.6394 0.0000 5.9024 356.9191 0.0000 0.0683 0.0000 0.0000 0.0000 65.0619 0.0000 30.7619 0.0003 37.5185 0.0000 3.4568 0.0000 14.5071 0.0000 4.5187 0.0000 5.7294 17.9797 0.0000 0.6571 15.1772 0.0001 324.3629 51.6436 0.0002 28.4161 0.0000 1.7645 0.0308 19.9549 0.0000 2.0225 9.9071 3.0297 22.0349 0.6998 32.9354 526.1898 0.0002 10.4472 1.5433 0.0000 106.1255 40.5644 0.0000 75.1383 0.0287 0.0000 129.2287 0.2131 46.4550 0.4268 49.4837 5.3782 0.0000 0.0356 10.4658 12.3006 95.9785 0.1927 198.0060 16.0455 0.0214 37.5177 0.0033
temp: 298.150 k
press: 1.00000 atm
elementType: 8 8 7 7 6 6 6 6 6 6 6 6 6 6 6 6 6 6 1 1 1 1 1 1 1 1 1 1 1 1 1 1 1 1 1 1 1 1 1 1 1 1 1 1
symmnumber: 1
zpe: 1012112.3 jmol-1
zpe.correction: 0.385493 hartree
zpe.thermalcorrener: 0.406445 hartree
zpe.thermalcorrenthalpy: 0.407389 hartree
zpe.thermalcorrgfe: 0.331723 hartree
zpe.sumelectzpe: -807.614640 hartree
zpe.sumelectthermal: -807.593689 hartree
zpe.sumelectthermalent: -807.592744 hartree
zpe.sumelectthermalfe: -807.668410 hartree
dipole: 0.0000 0.0000 0.0001
dipole: 0.0001
quadrupole: -117.9209 -122.8753 -108.7298
quadrupole: 22.8714 -2.0888 0.6204
quadrupole: -1.4123 -6.3666 7.7789 22.8714 -2.0888 0.6204
hfenergy: -808.0001334 hartree
pointgroup: C01 [X(C14H26N2O2)]
dipole: -0.0000031 -0.0000017 -0.0000226 debye
polarizability: 244.1124602|6.2969192|156.547591|-6.2796488|-4.3770156|124.9035217 unknown
InChI: InChI=1S/C14H26N2O2/c1-3-5-7-13(17)15-9-11-16(12-10-15)14(18)8-6-4-2/h3-12H2,1-2H3
charge 0 multiplicity 1
44 atoms
O  -2.937116 -1.973993 0.120407
O  2.937302 1.9742 -0.119372
N  -1.330246 -0.370452 -0.367396
N  1.3304 0.370638 0.368258
C  -0.8556 1.003708 -0.629989
C  -0.25981 -1.388684 -0.36961
C  0.259968 1.388874 0.370461
C  0.855753 -1.003522 0.630849
C  -2.65018 -0.758555 -0.121064
C  2.650346 0.758745 0.121991
C  -3.727767 0.336859 -0.159011
C  3.727953 -0.336642 0.160119
C  -5.146056 -0.229807 0.052016
C  5.146256 0.230054 -0.050735
C  -6.228493 0.871727 0.020067
C  6.228743 -0.871417 -0.018345
C  -7.651382 0.308745 0.226803
C  7.651639 -0.30841 -0.224962
H  -0.449745 1.063825 -1.660762
H  -1.686842 1.719268 -0.546346
H  -0.7201 -2.352893 -0.097804
H  0.171158 -1.467676 -1.388792
H  -0.170996 1.467883 1.389644
H  0.720265 2.353078 0.098643
H  1.686996 -1.71908 0.547208
H  0.449891 -1.063645 1.66162
H  -3.680745 0.870984 -1.13034
H  -3.512714 1.095475 0.622262
H  3.513026 -1.095295 -0.621152
H  3.680812 -0.870731 1.131463
H  -5.182602 -0.770776 1.016027
H  -5.354925 -0.988723 -0.725433
H  5.354925 0.989136 0.726606
H  5.182973 0.770833 -1.014846
H  -6.182477 1.409728 -0.949633
H  -6.012868 1.626334 0.80492
H  6.182583 -1.409194 0.951472
H  6.013299 -1.626221 -0.80306
H  -8.412521 1.110118 0.203379
H  -7.905072 -0.423482 -0.562638
H  -7.733739 -0.209178 1.200796
H  8.412815 -1.109739 -0.201227
H  7.734136 0.209299 -1.199056
H  7.905157 0.424007 0.564359
