program: Gaussian 09
title: 000213706
version: EM64L-G09RevD.01
frameworkgroup: C1[X(C23H27N3O)]
method: RPBEPBE
basis: SDD
operation: Freq
keyword: #p
keyword: freq=noraman
keyword: PBEPBE/SDD
title: #p freq=noraman PBEPBE/SDD
converged: YES YES NO NO
title: Mulliken charges:
elementType: O N N N C C C C C C C C C C C C C C C C C C C C C C C H H H H H H H H H H H H H H H H H H H H H H H H H H H
charge: -0.289877 -0.059811 -0.415501 -0.407287 -0.053541 -0.470635 -0.422884 -0.370641 -0.389776 -0.346808 -0.571477 0.410595 0.158260 0.108363 -0.448496 0.224858 0.266677 -0.411091 -0.353013 -0.259939 -0.359723 -0.348084 -0.218403 -0.355515 -0.432982 0.451640 -0.806279 0.268132 0.218120 0.209611 0.241194 0.208381 0.152733 0.219553 0.218018 0.181467 0.195266 0.221205 0.209926 0.224188 0.298877 0.269953 0.303594 0.228014 0.225950 0.218287 0.273441 0.209622 0.220526 0.232159 0.231038 0.224746 0.232578 0.234792
chargesum: 0.00000
title: Mulliken charges with hydrogens summed into heavy atoms:
elementType: O N N N C C C C C C C C C C C C C C C C C C C C C C C
charge: -0.289877 -0.059811 -0.116624 -0.103693 0.214591 -0.042904 0.026690 0.001645 0.009709 0.069663 -0.137363 0.410595 0.158260 0.108363 -0.178542 0.224858 0.266677 -0.183077 -0.127062 -0.041653 -0.086282 -0.138462 0.002124 -0.123356 -0.201944 0.451640 -0.114164
polarizability: 3.19500466e+02 -1.71563312e+01 3.12538823e+02 9.22323455e-01 2.19222591e+01 1.86756063e+02
1716.lowfreq: -3.7769 -1.0351 -0.0007 0.0006 0.0008 7.1648 11.6389 13.0690 15.1006
frequency: 11.5029 12.9526 14.1382 23.2792 30.3217 41.1828 55.7181 61.9825 79.8302 102.5942 111.5354 150.9368 165.3523 193.2640 217.6708 219.6663 239.6031 247.4793 268.0687 292.3697 319.4800 339.3101 341.2265 380.9463 396.4430 405.0013 412.7975 422.8714 453.7065 456.2551 477.1004 491.9329 501.2427 517.9888 525.3958 539.9935 576.0239 584.6970 593.5577 633.2381 635.4735 662.7171 693.8161 723.5043 742.0119 746.2588 746.7699 757.5372 770.0591 781.5729 784.4891 801.0285 808.9649 824.6795 829.0190 847.6040 861.0186 867.2777 881.5168 906.7339 928.2298 950.2331 959.0571 967.6169 986.3136 988.0406 994.8153 1004.6924 1009.8839 1013.2197 1015.8097 1036.8164 1047.5832 1055.5555 1068.3170 1089.6411 1095.7247 1102.7516 1120.2304 1125.7242 1132.2722 1135.6443 1150.9001 1164.9691 1175.1478 1184.0782 1194.7777 1223.2753 1225.7364 1237.6064 1247.2653 1255.9313 1261.1217 1284.7775 1287.3641 1293.1948 1305.0406 1307.6157 1310.2690 1335.3131 1337.2011 1347.7047 1350.4809 1364.5955 1366.2377 1370.0086 1390.5104 1394.3097 1397.7623 1405.4831 1420.6648 1444.2799 1456.0146 1458.6769 1460.2900 1462.4892 1469.6598 1471.1031 1473.4223 1475.6619 1482.2770 1484.6988 1509.0303 1561.0905 1563.9110 1586.6816 1598.3041 1622.3537 1631.3645 2761.4098 2831.7569 2858.2171 2977.5589 2981.4649 2997.5380 3001.4751 3024.6893 3030.2858 3034.3244 3040.9847 3053.6389 3055.8921 3063.3571 3073.7212 3085.7512 3111.1438 3120.5382 3123.5723 3128.0167 3138.0844 3142.3793 3160.5982 3161.0256 3219.3754 3549.6625 3613.6059
redmass: 3.8497 2.3027 1.6850 3.4149 4.3040 4.5882 3.8670 3.8806 4.0808 3.6246 4.3183 3.7183 3.7434 3.2536 2.9961 3.5681 2.9166 4.0170 3.2932 3.7804 4.7040 2.5637 2.9512 2.1081 3.2743 2.8045 2.9673 2.8226 3.2410 3.3880 3.1141 3.3448 1.2696 2.4796 1.4263 5.4850 3.0973 4.3611 5.3132 3.3432 6.6363 2.5958 3.8090 4.0039 2.7895 1.7818 2.0417 3.6429 4.4169 2.5760 1.4068 1.5624 1.9325 4.1216 1.6056 1.5082 1.3218 5.1114 3.4527 2.4564 1.3836 1.5918 2.0145 1.2989 1.4200 2.5276 1.3677 1.6417 1.9958 2.8663 1.9629 3.4404 1.5724 2.1591 2.9980 1.7189 1.4798 2.3784 1.6270 1.8511 1.4820 2.6694 2.6344 1.1331 1.2167 1.1597 1.1328 3.0259 1.7192 2.3056 1.4529 1.6434 1.4878 1.4818 1.2484 1.5617 1.7987 1.3160 1.4892 1.3756 1.5458 1.7969 1.4985 1.3392 1.3999 4.2659 4.8650 1.4649 1.2537 3.4945 2.3448 1.0963 1.0892 2.0744 1.4943 1.6698 1.0463 1.0975 1.1072 1.1871 3.0327 1.1299 2.6896 6.3709 6.2839 6.2066 7.0128 6.3541 6.8993 1.0714 1.0710 1.0702 1.0373 1.0625 1.0619 1.0630 1.0873 1.0854 1.0856 1.0866 1.0994 1.0974 1.1012 1.1015 1.0989 1.0871 1.0849 1.0895 1.0888 1.0959 1.0951 1.0950 1.1001 1.0983 1.0769 1.0809
irintensity: 0.3163 1.6755 0.3421 1.3305 0.3369 1.4303 4.0762 2.1801 0.1329 1.3088 0.7229 1.0732 0.5636 5.1814 4.0393 4.3083 9.0093 0.7927 6.4475 2.3956 0.8616 5.4474 4.2002 0.5099 1.0701 0.1281 3.4189 14.1378 6.5072 2.0370 3.6438 5.5031 90.0768 19.8983 78.0121 1.6079 8.2071 7.4764 4.0576 0.7447 0.8951 14.1532 7.3603 3.2505 23.9859 68.5427 47.4838 10.1037 5.3498 9.5847 4.2112 2.3793 11.9569 1.4514 23.4515 0.1598 11.4703 1.2329 8.0814 9.5450 2.2212 3.4853 3.1354 0.0759 2.1622 27.6497 3.5909 0.5267 5.9975 5.4122 15.3690 10.8827 13.8965 5.4780 6.3822 29.2484 29.6993 17.9938 12.5260 41.3363 5.0850 2.4225 45.6891 1.3696 2.2643 10.0865 18.5465 1.4138 10.2737 14.3425 6.9072 51.2607 24.7910 10.7830 2.8046 21.8239 17.2308 3.8241 11.2295 16.4248 15.9960 21.9822 14.2368 3.1202 24.5710 2.1373 34.6010 1.8303 10.1175 1.9542 2.7026 30.0095 17.8742 8.6539 20.5696 381.5106 12.8030 2.3034 8.4479 66.8444 3.2661 39.4478 42.2859 83.6024 2.1024 0.1706 78.1015 31.0187 2.3777 115.4654 84.1128 115.0390 33.8865 32.5133 26.1140 17.5778 4.6636 47.2249 38.4892 40.3923 36.5181 19.2156 29.6753 32.9270 18.5474 18.9610 4.6878 20.9185 4.0027 20.3687 44.2927 4.6963 28.4765 1.2395 22.3573 62.5085
temp: 298.150 k
press: 1.00000 atm
elementType: 8 7 7 7 6 6 6 6 6 6 6 6 6 6 6 6 6 6 6 6 6 6 6 6 6 6 6 1 1 1 1 1 1 1 1 1 1 1 1 1 1 1 1 1 1 1 1 1 1 1 1 1 1 1
symmnumber: 1
zpe: 1187590.3 jmol-1
zpe.correction: 0.452329 hartree
zpe.thermalcorrener: 0.477174 hartree
zpe.thermalcorrenthalpy: 0.478118 hartree
zpe.thermalcorrgfe: 0.392114 hartree
zpe.sumelectzpe: -1130.185007 hartree
zpe.sumelectthermal: -1130.160162 hartree
zpe.sumelectthermalent: -1130.159218 hartree
zpe.sumelectthermalfe: -1130.245222 hartree
dipole: 3.3249 2.5384 -0.0932
dipole: 4.1842
quadrupole: -143.9878 -157.3655 -157.2427
quadrupole: -27.5573 -12.7637 1.6190
quadrupole: 8.8775 -4.5002 -4.3774 -27.5573 -12.7637 1.6190
hfenergy: -1130.6373362 hartree
pointgroup: C01 [X(C23H27N3O1)]
dipole: -1.3432254 0.9507853 0.0405937 debye
polarizability: 318.2567829|17.355657|313.9631653|1.7875045|-21.3422617|186.575405 unknown
InChI: InChI=1S/C23H27N3O/c1-17-6-8-18(9-7-17)23(27)25-20-11-14-26(15-12-20)13-10-19-16-24-22-5-3-2-4-21(19)22/h2-9,16,20,24-25H,10-15H2,1H3
charge 0 multiplicity 1
54 atoms
O  4.615063 -2.21461 0.474237
N  -0.820478 -1.990792 0.016796
N  2.767583 -1.2258 -0.522231
N  -6.558075 -0.508236 1.046516
C  2.029121 -2.503972 -0.641818
C  0.929378 -2.384571 -1.720348
C  1.389014 -2.928791 0.707238
C  -0.249046 -1.498323 -1.257537
C  0.211822 -2.013975 1.088859
C  -2.039399 -1.251772 0.429938
C  -3.283944 -1.610279 -0.426974
C  -4.533922 -0.912317 0.050993
C  4.037649 -1.169974 0.025112
C  -4.866597 0.495136 -0.11486
C  -5.589181 -1.484747 0.761306
C  -6.141499 0.719067 0.518865
C  4.700209 0.183829 0.071781
C  -4.21586 1.588439 -0.747833
C  -6.76639 1.985897 0.538474
C  -4.834116 2.853572 -0.734507
C  5.800239 0.343668 0.953273
C  4.303583 1.288276 -0.724802
C  -6.095279 3.050892 -0.096117
C  6.468099 1.578187 1.052123
C  4.980198 2.524041 -0.625077
C  6.068671 2.693903 0.267454
C  6.798728 4.020671 0.375504
H  2.774604 -3.266356 -0.931857
H  0.537887 -3.39742 -1.925882
H  1.355385 -1.9882 -2.66213
H  2.16196 -2.917794 1.495669
H  1.018968 -3.966758 0.60532
H  0.084552 -0.424838 -1.158769
H  -1.032425 -1.507088 -2.035627
H  -0.261942 -2.384961 2.016139
H  0.595391 -0.981872 1.306678
H  -1.879741 -0.143162 0.411715
H  -2.258232 -1.521671 1.479854
H  -3.096054 -1.346671 -1.48661
H  -3.411657 -2.707657 -0.391079
H  2.283247 -0.361866 -0.768931
H  -5.722491 -2.517255 1.08029
H  -7.428957 -0.670964 1.546259
H  -3.247871 1.449898 -1.243393
H  -7.735878 2.142589 1.025012
H  -4.343916 3.70484 -1.220155
H  6.112473 -0.523883 1.543941
H  3.491655 1.192847 -1.456623
H  -6.550081 4.047847 -0.100612
H  7.313016 1.683063 1.743882
H  4.665392 3.36479 -1.254762
H  6.340365 4.790688 -0.268232
H  6.790718 4.398975 1.414859
H  7.859261 3.918962 0.076881
