program: Gaussian 09
title: 000205857
version: EM64L-G09RevD.01
frameworkgroup: C1[X(C16H24N2O)]
method: RPBEPBE
basis: SDD
operation: Freq
keyword: #p
keyword: freq=noraman
keyword: PBEPBE/SDD
title: #p freq=noraman PBEPBE/SDD
converged: YES YES NO NO
title: Mulliken charges:
elementType: O N N C C C C C C C C C C C C C C C C H H H H H H H H H H H H H H H H H H H H H H H H
charge: -0.449940 -0.328567 -0.018153 0.345833 -0.423543 -0.454657 -0.015491 -0.729555 -0.749324 -0.278336 -0.469552 -0.743524 0.435154 -0.394591 -0.405546 -0.161204 -0.232994 -0.232156 -0.241125 0.222572 0.182741 0.231533 0.222077 0.218540 0.236909 0.206973 0.203128 0.251115 0.209050 0.218964 0.218039 0.187950 0.262146 0.263378 0.244779 0.235621 0.216583 0.346184 0.225471 0.263158 0.226148 0.225549 0.228664
chargesum: 0.00000
title: Mulliken charges with hydrogens summed into heavy atoms:
elementType: O N N C C C C C C C C C C C C C C C C
charge: -0.103755 -0.091658 -0.018153 0.345833 -0.018230 -0.001047 0.203049 -0.068339 -0.103271 -0.090386 0.055973 -0.046541 0.435154 -0.169121 -0.142388 -0.161204 -0.006847 -0.006607 -0.012461
polarizability: 2.10653558e+02 -1.73299600e+01 1.60683206e+02 -3.23680476e+00 -6.19639609e+00 1.77072959e+02
1716.lowfreq: -10.5343 -8.4202 -0.0006 -0.0004 -0.0001 5.4578 12.4850 29.3486 32.1837
frequency: 4.9042 27.1337 31.9841 37.7016 65.1752 89.2778 97.5594 109.3325 127.0828 160.7360 175.7886 200.0324 214.7832 216.1211 228.6466 242.7314 264.0841 280.0801 307.8223 329.1082 344.0978 356.5231 372.6086 389.4635 408.0460 417.3177 446.3779 463.4355 471.0455 524.3590 549.1801 575.7724 615.4221 652.4212 691.3426 707.2352 753.8813 759.7110 772.7472 802.5434 853.2192 853.7540 901.6746 918.7582 922.2431 931.0125 935.0876 941.7232 953.4375 975.4948 981.5776 989.3905 995.0136 995.9495 1025.6604 1038.5276 1041.9900 1064.2105 1069.1598 1083.2941 1116.4170 1146.3227 1153.3968 1171.1822 1175.2103 1183.8527 1194.1486 1206.8113 1237.2255 1239.7088 1263.5099 1276.1528 1286.5905 1304.4052 1310.4295 1328.6332 1338.9388 1342.8358 1355.8479 1366.6564 1380.6132 1386.5446 1387.9121 1399.5765 1438.0621 1446.4509 1457.7552 1463.1805 1471.5218 1472.1721 1478.3062 1480.7232 1483.7203 1489.8954 1490.5193 1496.5029 1592.7200 1612.4145 2196.1318 2835.7999 2873.9075 2902.6889 2970.3597 2975.2029 2983.7535 2993.3725 2995.0165 3033.4571 3039.2701 3058.4017 3061.3256 3065.3003 3071.2868 3087.0293 3088.0252 3103.0587 3121.4598 3127.4714 3140.0128 3149.0591 3163.6497 3401.8705 3559.4696
redmass: 4.7414 6.0749 5.1694 3.4682 3.0963 2.7460 3.7117 3.1098 4.5304 2.2567 1.1463 3.4074 2.1557 1.8725 2.3600 2.4204 2.4136 1.7480 2.5628 2.0461 1.4493 1.9602 3.5551 3.4605 2.6751 3.0064 2.6247 3.6557 2.7511 4.2044 3.0291 3.5199 6.4120 4.0164 1.4139 1.7038 2.4187 1.2924 2.9299 3.0874 1.4934 1.8172 2.0875 1.5170 2.1526 1.7514 3.7294 1.4867 1.5674 1.3986 3.7915 5.5804 1.6269 1.3906 2.1844 3.0344 1.5839 1.8575 1.8635 1.6630 1.8877 1.6237 1.9519 1.0652 1.8676 1.1384 2.0738 1.7390 1.4230 1.5412 1.4189 1.5888 1.5222 1.2689 1.3502 1.4619 1.3426 1.4389 1.4243 1.4114 1.1946 1.8147 2.3326 1.2173 2.1260 1.1112 1.0613 1.1981 1.0699 1.0565 1.0621 2.0645 1.1309 1.0675 1.0602 1.0656 6.1253 6.1023 12.4172 1.0723 1.0814 1.0843 1.0355 1.0364 1.0602 1.0596 1.0358 1.0986 1.0855 1.1015 1.0988 1.0993 1.0986 1.0989 1.0990 1.1001 1.0844 1.0874 1.0920 1.0961 1.1015 1.0728 1.0658
irintensity: 0.3505 1.2878 2.6804 0.3779 3.8554 2.7631 1.0382 0.5837 4.3610 1.2020 0.1932 4.4553 0.8418 1.7145 0.1765 0.5495 2.9870 0.3533 5.3152 2.0162 95.2965 58.6562 1.0813 8.4894 5.8995 9.4287 5.4236 0.2383 1.7878 5.1265 12.2096 3.2754 0.0168 15.0590 69.8941 49.3847 36.4149 6.6164 6.0071 5.9091 3.0588 8.7680 3.7346 5.2812 6.5344 2.4764 1.5558 2.0196 3.0804 1.1039 63.6853 0.5723 4.1641 1.4012 5.4054 2.0741 3.6223 12.0919 2.6713 4.4115 57.0239 5.4707 41.4537 0.0356 13.7628 0.0187 7.3398 19.0394 10.0757 17.0705 18.9271 3.6974 13.1810 4.1391 19.5273 23.4104 1.9521 1.8686 21.3173 17.9414 22.3001 15.9430 10.4715 15.9943 13.8462 11.8208 0.2323 18.8538 3.9783 9.6707 7.4408 19.3241 12.5483 0.6166 17.7874 31.3643 0.5772 1.6458 19.0350 124.9896 74.5193 66.5485 34.2122 27.6483 6.6726 18.3046 15.9248 7.1383 16.2122 30.7443 31.3023 20.7187 74.2804 19.3005 47.3507 17.1078 3.1790 1.5508 22.5186 36.8579 19.1048 4.8365 5.6471
temp: 298.150 k
press: 1.00000 atm
elementType: 8 7 7 6 6 6 6 6 6 6 6 6 6 6 6 6 6 6 6 1 1 1 1 1 1 1 1 1 1 1 1 1 1 1 1 1 1 1 1 1 1 1 1
symmnumber: 1
zpe: 964058.8 jmol-1
zpe.correction: 0.367191 hartree
zpe.thermalcorrener: 0.388255 hartree
zpe.thermalcorrenthalpy: 0.389199 hartree
zpe.thermalcorrgfe: 0.314488 hartree
zpe.sumelectzpe: -807.332048 hartree
zpe.sumelectthermal: -807.310984 hartree
zpe.sumelectthermalent: -807.310040 hartree
zpe.sumelectthermalfe: -807.384750 hartree
dipole: 1.6464 -2.7717 -1.6213
dipole: 3.6085
quadrupole: -119.8967 -124.6753 -121.1382
quadrupole: 15.1028 14.5724 -6.4181
quadrupole: 2.0067 -2.7719 0.7652 15.1028 14.5724 -6.4181
hfenergy: -807.6992387 hartree
pointgroup: C01 [X(C16H24N2O1)]
dipole: 0.6869843 1.2378614 0.1063561 debye
polarizability: 211.7953878|15.269696|157.8901945|-4.1905438|2.9051388|178.7241414 unknown
InChI: InChI=1S/C16H24N2O/c1-13(15(19)14-8-5-4-6-9-14)18-12-16(2,3)10-7-11-17/h4-6,8-9,13,15,18-19H,7,10,12H2,1-3H3
charge 0 multiplicity 1
43 atoms
O  2.193399 -1.334816 2.542519
N  -0.495951 0.316596 0.641557
N  -4.881126 -2.959032 -0.530169
C  -2.512997 1.486424 -0.351919
C  -1.560449 1.315973 0.87285
C  -3.145658 0.128165 -0.791588
C  0.539365 0.191034 1.703727
C  -1.705276 2.041288 -1.554933
C  -3.620357 2.500426 0.037103
C  1.510021 -0.959818 1.291432
C  -3.952474 -0.608031 0.318321
C  1.275023 1.51729 1.960986
C  2.499161 -0.619391 0.179217
C  2.131705 -0.787609 -1.179496
C  3.797417 -0.13552 0.482757
C  -4.470721 -1.907613 -0.141562
C  3.038563 -0.471409 -2.215221
C  4.707805 0.176672 -0.552099
C  4.331586 0.011165 -1.904872
H  -1.082619 2.295528 1.052929
H  -2.168637 1.094051 1.78846
H  -3.819978 0.315523 -1.649077
H  -2.351944 -0.545214 -1.170091
H  0.097652 -0.149384 2.67353
H  -0.903338 -0.610013 0.444237
H  -1.322719 3.054968 -1.332102
H  -2.335684 2.108189 -2.461718
H  -0.836516 1.393949 -1.766272
H  -4.198101 2.17487 0.922982
H  -4.329013 2.649272 -0.798966
H  -3.176122 3.483981 0.278932
H  0.878774 -1.813847 0.948987
H  -4.807759 0.011316 0.646674
H  -3.323434 -0.781437 1.21272
H  2.139705 1.32922 2.619898
H  1.632341 1.958436 1.014445
H  0.623444 2.248128 2.471338
H  2.881287 -2.016913 2.333501
H  1.131289 -1.161012 -1.426764
H  4.086106 0.000362 1.530822
H  2.740367 -0.605652 -3.261189
H  5.708236 0.548992 -0.303356
H  5.037928 0.250996 -2.707628
