program: Gaussian 09
title: 000205855
version: EM64L-G09RevD.01
frameworkgroup: C1[X(C7H13N2O4PS)]
method: RPBEPBE
basis: SDD
operation: Freq
keyword: #p
keyword: freq=noraman
keyword: PBEPBE/SDD
title: #p freq=noraman PBEPBE/SDD
converged: YES YES NO NO
title: Mulliken charges:
elementType: S P O O O O N N C C C C C C C H H H H H H H H H H H H H
charge: -0.216458 0.886876 -0.470062 -0.461759 -0.457023 -0.231029 -0.105698 -0.639215 -0.212797 -0.243790 0.312658 -0.654629 -0.648549 -0.496208 0.363804 0.232637 0.225374 0.264452 0.233066 0.208431 0.235377 0.236929 0.212252 0.229915 0.243001 0.271042 0.342451 0.338950
chargesum: 0.00000
title: Mulliken charges with hydrogens summed into heavy atoms:
elementType: S P O O O O N N C C C C C C C
charge: -0.216458 0.886876 -0.470062 -0.461759 -0.457023 -0.231029 -0.105698 0.042186 0.245214 0.253728 0.312658 0.026108 0.036619 -0.225166 0.363804
polarizability: 1.87074991e+02 -7.55695804e-01 1.48352343e+02 -8.85909402e-01 3.87251674e+00 1.16524011e+02
1716.lowfreq: -4.8643 -0.0011 -0.0009 0.0021 5.4310 17.5463 29.3641 34.1750 46.0028
frequency: 28.3421 33.4504 45.9202 49.7404 58.0014 75.2506 86.7509 105.6845 145.1097 158.7866 177.0862 216.4304 232.6781 242.5719 248.3339 269.8465 294.1163 306.5579 328.9895 366.0576 393.9381 396.3784 417.0674 423.6578 512.7710 586.3816 608.1278 660.0446 669.9963 685.7848 720.1583 748.3859 764.0027 797.4023 810.0979 830.9853 865.6180 891.3141 919.2220 992.3482 1002.6846 1017.5907 1023.1591 1095.3509 1106.2867 1133.8449 1147.1917 1170.3647 1252.6637 1265.8262 1290.4030 1353.2661 1357.4932 1391.8957 1394.3252 1428.3816 1454.0510 1456.7003 1461.2522 1473.7613 1477.7035 1486.2617 1487.4113 1602.9190 1660.8313 2987.9729 2990.6942 2997.2548 3028.8047 3059.1033 3084.0149 3089.8529 3093.6317 3112.9720 3115.2763 3265.1829 3572.5211 3717.9697
redmass: 3.0568 5.0584 2.8240 2.6695 4.8391 4.2624 4.5785 4.1451 4.3774 5.9882 5.3853 2.2275 1.2979 4.7524 1.6969 1.0920 3.3134 5.0375 4.6325 10.5460 1.4237 2.8945 4.3931 4.7049 8.2806 9.7870 10.1119 8.0590 2.7678 6.3800 6.9119 9.3914 1.7174 1.1289 1.0920 9.0614 4.8101 3.8576 5.2028 5.0906 2.4764 1.5440 2.7673 2.2176 2.2311 1.4202 1.5462 2.0285 1.1456 1.1060 3.8687 1.2212 1.2497 1.2329 1.2443 7.2122 6.9142 1.0418 1.0454 1.0711 1.0574 1.0604 1.0758 1.2812 4.6557 1.0364 1.0539 1.0394 1.0602 1.1075 1.0966 1.1042 1.0980 1.1023 1.1057 1.0999 1.0453 1.1048
irintensity: 0.8513 4.3638 1.5180 6.3223 0.6974 1.6615 0.7152 4.4121 7.0815 2.6172 11.6605 1.8409 1.1042 4.9525 0.9119 8.2997 9.4346 5.0309 19.7137 8.8009 259.3297 70.3845 22.5251 25.0547 15.1137 111.5071 17.5582 80.5569 3.0759 50.0344 112.9758 74.1542 83.9864 7.0636 3.9112 12.0770 251.2101 117.3630 9.9004 55.0542 175.8503 2.6108 64.0549 6.6897 6.1453 4.9917 9.2616 89.7876 0.1919 1.8790 4.5662 7.2127 5.8892 36.0475 29.1405 177.6872 294.4333 17.2619 12.9655 8.2519 5.3752 10.8503 14.0009 5.1693 576.6963 23.0637 20.5316 26.1127 12.7189 12.2100 26.0472 3.8577 25.1678 30.9647 22.1184 3.0935 145.5769 54.7371
temp: 298.150 k
press: 1.00000 atm
elementType: 16 15 8 8 8 8 7 7 6 6 6 6 6 6 6 1 1 1 1 1 1 1 1 1 1 1 1 1
symmnumber: 1
zpe: 545917.4 jmol-1
zpe.correction: 0.207929 hartree
zpe.thermalcorrener: 0.226392 hartree
zpe.thermalcorrenthalpy: 0.227336 hartree
zpe.thermalcorrgfe: 0.159102 hartree
zpe.sumelectzpe: -1422.993704 hartree
zpe.sumelectthermal: -1422.975241 hartree
zpe.sumelectthermalent: -1422.974297 hartree
zpe.sumelectthermalfe: -1423.042531 hartree
dipole: 3.7857 -2.8545 -0.3541
dipole: 4.7545
quadrupole: -69.4032 -87.6350 -113.2690
quadrupole: -6.3623 -0.5360 -3.1153
quadrupole: 20.6992 2.4674 -23.1666 -6.3623 -0.5360 -3.1153
hfenergy: -1423.2016332 hartree
pointgroup: C01 [X(C7H13N2O4P1S1)]
dipole: -1.8288975 -0.3926175 0.0034237 debye
polarizability: 180.6766787|-13.5724316|153.5475743|4.8131657|-7.767777|117.7270922 unknown
InChI: InChI=1S/C7H13N2O4PS/c1-3-10-14(15,11-4-2)13-7-5-6(8)12-9-7/h5H,3-4,8H2,1-2H3
charge 0 multiplicity 1
28 atoms
S  1.892654 -0.346401 -2.06168
P  1.453238 -0.590868 -0.065397
O  2.089752 -1.936264 0.77929
O  1.894688 0.588088 1.086786
O  -0.275309 -0.980682 0.275751
O  -2.334699 1.801778 -0.569934
N  -0.997784 1.22659 -0.264965
N  -4.577084 1.131788 -0.750501
C  1.916769 -3.295473 0.175856
C  2.049399 2.027969 0.671782
C  -1.273855 -0.086704 -0.057336
C  2.765095 -4.235164 1.025763
C  3.495452 2.317745 0.274442
C  -2.655041 -0.437285 -0.18381
C  -3.278894 0.767189 -0.500591
H  0.843389 -3.557001 0.211165
H  2.254514 -3.266569 -0.878207
H  1.322983 2.254723 -0.1283
H  1.75066 2.566135 1.586189
H  2.672665 -5.268705 0.643682
H  3.827272 -3.940432 0.991699
H  2.429734 -4.218399 2.076329
H  3.613122 3.402389 0.08858
H  4.190125 2.027031 1.081092
H  3.769634 1.777675 -0.647714
H  -3.091567 -1.422698 -0.062105
H  -4.794336 2.097145 -0.984265
H  -5.322178 0.443702 -0.7173
