program: Gaussian 09
title: 000205854
version: EM64L-G09RevD.01
frameworkgroup: C1[X(C8H13BrNO4PS)]
method: RPBEPBE
basis: SDD
operation: Freq
keyword: #p
keyword: freq=noraman
keyword: PBEPBE/SDD
title: #p freq=noraman PBEPBE/SDD
converged: YES YES NO NO
title: Mulliken charges:
elementType: Br S P O O O O N C C C C C C C C H H H H H H H H H H H H H
charge: 0.030735 -0.199075 0.878065 -0.459198 -0.466184 -0.447119 -0.212377 -0.084171 -0.238943 -0.216104 0.384565 -0.454013 0.427419 -0.645413 -0.653438 -0.753621 0.238378 0.254978 0.226571 0.244231 0.214997 0.238868 0.233145 0.211592 0.238932 0.235022 0.257447 0.257920 0.256790
chargesum: 0.00000
title: Mulliken charges with hydrogens summed into heavy atoms:
elementType: Br S P O O O O N C C C C C C C C
charge: 0.030735 -0.199075 0.878065 -0.459198 -0.466184 -0.447119 -0.212377 -0.084171 0.254413 0.254699 0.384565 -0.454013 0.427419 0.041597 0.032109 0.018537
polarizability: 1.91723960e+02 7.73728849e-01 1.85457335e+02 -3.22856275e+00 -3.73001448e+00 1.24974011e+02
1716.lowfreq: -47.8643 -9.2663 -3.8080 -0.0010 0.0006 0.0014 5.2656 18.1338 29.2208
frequency: -47.8542 16.8784 28.9801 33.0182 44.4306 53.0645 57.5583 71.5943 95.7330 110.3380 125.9340 143.9532 173.4361 204.7647 220.4076 231.8359 247.3703 250.7232 282.5468 299.5786 306.4628 367.6820 372.1927 402.4890 413.5512 432.2512 522.6973 573.7574 599.1688 643.4611 686.7091 689.0677 723.2584 758.3496 789.4179 813.3186 854.6690 866.6154 887.2343 921.6732 1001.1389 1017.3190 1035.7990 1038.1403 1062.3246 1093.7640 1106.7742 1134.2974 1143.8425 1207.0907 1257.3474 1264.8544 1351.8219 1358.0318 1382.1079 1390.6954 1396.2994 1404.1067 1435.1331 1456.2208 1457.7872 1459.3466 1465.6748 1467.1201 1477.7577 1483.0824 1487.2639 1597.1639 2989.6284 2993.9094 2994.8770 2998.7676 3029.5136 3064.2783 3076.7893 3085.2404 3092.0924 3094.9678 3114.0125 3114.6114 3117.3053
redmass: 1.0174 6.2622 3.7968 5.3552 2.8439 3.3949 2.1361 7.8736 5.9868 4.9492 5.4707 4.1141 4.2759 5.4948 1.8627 1.6938 1.6058 5.4161 5.9334 3.7313 5.2822 9.6398 8.5408 4.2203 4.3864 6.1591 9.1368 7.4118 11.4973 6.6547 8.7977 6.4441 6.9301 11.9183 1.1327 1.0925 10.7072 5.2022 4.1325 2.7641 2.4078 2.6962 5.4250 1.4531 4.4895 2.2331 2.2315 1.4209 1.5517 4.7341 1.1413 1.1077 1.2220 1.2535 5.7283 1.2380 1.2426 1.3032 9.0966 1.0428 1.0394 1.0435 1.1059 1.0792 1.0560 1.0562 1.0793 10.0225 1.0364 1.0525 1.0371 1.0411 1.0604 1.1075 1.0981 1.0975 1.1028 1.0980 1.0989 1.1025 1.1057
irintensity: 0.1394 0.6175 1.0918 0.6218 1.3673 1.9734 2.3160 0.7395 1.8881 1.4592 2.9584 6.1554 6.3461 1.8443 0.2996 2.3584 1.2435 1.8551 18.9849 1.6197 7.0144 14.9567 7.8655 8.1402 3.2691 39.4464 25.8625 7.3289 147.7655 62.8095 12.5004 40.9599 115.8040 56.5619 6.2532 3.9840 14.6048 286.2004 101.5862 14.7468 177.3842 70.4245 35.4212 5.6494 112.0447 7.9866 6.5225 5.0166 9.3590 2.1519 0.1620 0.5196 7.2908 7.1753 3.9346 36.6480 28.5844 7.7242 422.3834 17.8771 12.8075 12.3502 28.1308 20.0018 5.3177 11.6050 12.0134 56.7551 19.9481 17.9692 8.4003 22.8800 12.0159 9.9623 7.0258 22.9711 4.7134 22.5708 3.9448 29.3562 22.8193
temp: 298.150 k
press: 1.00000 atm
elementType: 35 16 15 8 8 8 8 7 6 6 6 6 6 6 6 6 1 1 1 1 1 1 1 1 1 1 1 1 1
symmnumber: 1
zpe: 547378.1 jmol-1
zpe.correction: 0.208485 hartree
zpe.thermalcorrener: 0.227970 hartree
zpe.thermalcorrenthalpy: 0.228914 hartree
zpe.thermalcorrgfe: 0.156087 hartree
zpe.sumelectzpe: -1419.729960 hartree
zpe.sumelectthermal: -1419.710475 hartree
zpe.sumelectthermalent: -1419.709531 hartree
zpe.sumelectthermalfe: -1419.782358 hartree
dipole: 1.7373 0.5408 -0.3059
dipole: 1.8451
quadrupole: -101.3780 -105.9940 -125.4999
quadrupole: -4.6302 1.8378 4.6512
quadrupole: 9.5793 4.9633 -14.5426 -4.6302 1.8378 4.6512
hfenergy: -1419.9384451 hartree
pointgroup: C01 [X(C8H13Br1N1O4P1S1)]
dipole: -0.588262 0.41528 0.0918878 debye
polarizability: 190.6507616|-2.7626715|186.4241596|1.8061514|5.1138085|125.0803858 unknown
InChI: InChI=1S/C8H13BrNO4PS/c1-4-11-15(16,12-5-2)14-8-7(9)6(3)13-10-8/h4-5H2,1-3H3
charge 0 multiplicity 1
29 atoms
Br -2.655551 2.736713 0.041082
S  1.919675 -0.733886 -1.937289
P  1.622146 -0.147585 0.009646
O  1.690913 -1.279464 1.282219
O  2.621306 1.04434 0.713288
O  0.070411 0.750223 0.290467
O  -2.729855 -1.386031 -0.226108
N  -1.281781 -1.200552 -0.024861
C  1.515521 -2.74639 0.987991
C  2.802482 2.342013 -0.019663
C  -1.139264 0.144564 0.075535
C  -2.390958 0.843102 -0.039286
C  -3.35878 -0.129704 -0.222612
C  2.878352 -3.415761 0.826952
C  3.892676 3.093054 0.735506
C  -4.838375 -0.107685 -0.408314
H  0.971722 -3.103826 1.877155
H  0.869894 -2.867108 0.100211
H  3.09254 2.122824 -1.065339
H  1.837844 2.880699 -0.007571
H  2.740059 -4.509709 0.733938
H  3.395145 -3.055508 -0.078983
H  3.516562 -3.220666 1.705502
H  4.068504 4.072689 0.253793
H  3.592131 3.26686 1.78218
H  4.837037 2.523607 0.729971
H  -5.115341 0.471581 -1.307257
H  -5.219066 -1.13561 -0.520299
H  -5.338047 0.362722 0.457345
