program: Gaussian 09
title: 000205846
version: EM64L-G09RevD.01
frameworkgroup: C1[X(C9H14NO6PS)]
method: RPBEPBE
basis: SDD
operation: Freq
keyword: #p
keyword: freq=noraman
keyword: PBEPBE/SDD
title: #p freq=noraman PBEPBE/SDD
converged: YES YES NO NO
title: Mulliken charges:
elementType: S P O O O O O O N C C C C C C C C C H H H H H H H H H H H H H H
charge: -0.204361 0.871801 -0.461040 -0.452810 -0.433401 -0.171317 -0.271240 -0.212313 -0.069457 -0.236872 -0.257226 0.278298 -0.647402 -0.637571 -0.411078 0.213457 0.217226 -0.494176 0.239971 0.255297 0.238758 0.232539 0.233305 0.235330 0.217058 0.216721 0.239360 0.237518 0.298585 0.238306 0.248439 0.248294
chargesum: 0.00000
title: Mulliken charges with hydrogens summed into heavy atoms:
elementType: S P O O O O O O N C C C C C C C C C
charge: -0.204361 0.871801 -0.461040 -0.452810 -0.433401 -0.171317 -0.271240 -0.212313 -0.069457 0.258397 0.214070 0.278298 0.038290 0.056028 -0.112493 0.213457 0.217226 0.240864
polarizability: 2.31115353e+02 -2.83707078e+00 1.68622534e+02 -4.70903338e+00 -7.54353493e+00 1.28075452e+02
1716.lowfreq: -20.3847 -7.4152 -3.8178 -0.0015 0.0004 0.0012 16.1227 30.8581 35.1942
frequency: 15.6494 29.8970 35.1184 38.7713 45.6803 52.2657 69.1555 78.0154 91.5767 104.9878 108.0176 127.8272 141.2951 170.0836 192.8016 204.7413 218.4979 231.6455 248.2495 278.8643 289.5497 344.3303 349.9588 358.4904 393.9121 403.4093 432.9024 463.4284 523.0944 557.5509 584.2534 656.2612 685.0734 705.6004 721.7695 721.9839 748.4876 788.1770 796.5247 858.8053 859.3049 862.2102 874.0037 895.8412 938.3498 990.5502 999.4769 1015.0416 1054.8859 1092.3356 1093.7881 1113.4555 1140.3090 1144.5111 1148.5263 1161.6806 1234.9692 1266.1073 1270.5393 1349.9860 1351.5843 1358.9371 1392.7195 1393.6323 1421.3992 1432.2317 1453.0618 1458.9651 1460.5628 1461.4446 1462.5747 1464.9494 1477.8700 1482.4016 1553.6681 1655.0605 2989.9851 2991.3448 3004.9222 3008.0230 3031.1876 3082.4859 3085.2606 3092.7850 3092.8220 3111.0289 3114.2205 3118.0684 3156.4212 3273.8581
redmass: 5.0428 3.1809 6.1271 3.3285 2.7728 3.4266 6.2687 5.2007 1.9344 1.7782 5.9118 2.9700 4.3238 4.0431 4.3363 6.5566 2.0720 1.4155 1.9880 4.4800 4.9351 5.5912 8.2750 5.3149 7.1574 3.7901 3.5437 9.1918 7.7666 11.3954 12.2894 5.2561 6.2251 9.1020 7.4180 7.6581 6.9807 1.1433 1.1271 2.5167 1.9900 11.9143 3.6121 9.1605 6.5502 4.8841 2.4105 2.9777 4.5861 2.2064 2.2273 1.2617 1.5349 1.5568 1.5145 1.9216 7.4967 1.1092 1.1111 1.2219 1.3650 5.4373 1.2372 1.2282 1.3823 4.0828 1.0491 1.0688 1.0447 1.0481 1.0529 1.0767 1.0555 1.0552 8.1548 10.6205 1.0363 1.0365 1.0638 1.0296 1.0604 1.1002 1.0979 1.0983 1.1022 1.1049 1.1033 1.1060 1.1049 1.1007
irintensity: 1.7607 1.1133 1.3414 0.6239 1.5902 2.6934 0.5045 0.4406 0.0517 0.0464 0.9331 2.4631 4.7504 5.6027 10.2335 10.0707 3.7013 4.4251 4.5957 7.5951 20.6815 5.4749 3.8024 9.1034 26.4976 9.5491 5.5478 2.2126 46.0460 2.2421 150.3785 0.5878 40.1250 134.4294 71.7879 79.1998 34.4505 11.9010 5.7679 148.8508 154.0390 21.2860 47.9530 0.1286 19.0752 50.2851 175.3892 71.4728 217.8319 1.0361 17.6812 0.0301 5.9197 9.9753 70.6645 65.2113 123.8005 0.6839 0.7147 23.2995 39.1464 98.0590 36.5086 24.8476 11.9352 464.9927 15.3086 7.1442 17.3412 13.6958 11.9665 14.6705 10.9853 11.7992 116.1997 155.8213 19.0399 12.1776 30.9760 31.3074 11.4676 15.5777 21.7679 22.7648 3.7263 21.9413 26.0681 22.5236 12.3637 5.6635
temp: 298.150 k
press: 1.00000 atm
elementType: 16 15 8 8 8 8 8 8 7 6 6 6 6 6 6 6 6 6 1 1 1 1 1 1 1 1 1 1 1 1 1 1
symmnumber: 1
zpe: 608935.4 jmol-1
zpe.correction: 0.231931 hartree
zpe.thermalcorrener: 0.253622 hartree
zpe.thermalcorrenthalpy: 0.254566 hartree
zpe.thermalcorrgfe: 0.176956 hartree
zpe.sumelectzpe: -1595.271326 hartree
zpe.sumelectthermal: -1595.249635 hartree
zpe.sumelectthermalent: -1595.248691 hartree
zpe.sumelectthermalfe: -1595.326301 hartree
dipole: 0.2041 3.6241 -1.1332
dipole: 3.8026
quadrupole: -96.9072 -109.9396 -127.9879
quadrupole: 12.6835 -4.2933 3.6522
quadrupole: 14.7043 1.6720 -16.3763 12.6835 -4.2933 3.6522
hfenergy: -1595.5032576 hartree
pointgroup: C01 [X(C9H14N1O6P1S1)]
dipole: -0.339276 1.3244312 0.6073979 debye
polarizability: 228.1266753|14.2823246|169.4609044|-3.7476204|11.6588849|130.2257594 unknown
InChI: InChI=1S/C9H14NO6PS/c1-4-13-17(18,14-5-2)16-8-6-7(15-10-8)9(11)12-3/h6H,4-5H2,1-3H3
charge 0 multiplicity 1
32 atoms
S  3.026075 0.846921 -2.007809
P  2.583641 0.794766 0.000278
O  2.850365 -0.614785 0.924717
O  3.314702 1.927718 1.050557
O  0.877653 1.224337 0.429177
O  -1.309948 -1.35492 -0.679285
O  -4.422144 0.370701 0.085371
O  -4.140105 -1.770041 -0.825923
N  0.034154 -0.836836 -0.461363
C  3.045015 -1.938846 0.233225
C  3.75929 3.250322 0.504444
C  -0.161817 0.402966 0.067319
C  4.534301 -2.227648 0.062354
C  2.59473 4.22938 0.354397
C  -1.549377 0.736008 0.216249
C  -2.224894 -0.376964 -0.254064
C  -3.660843 -0.705408 -0.379709
C  -5.892357 0.175449 0.021961
H  2.554847 -2.643492 0.923974
H  2.495072 -1.935323 -0.724178
H  4.482824 3.581279 1.266486
H  4.283738 3.081872 -0.455894
H  5.060939 -2.155018 1.029128
H  4.998618 -1.527005 -0.65287
H  4.665057 -3.254828 -0.327735
H  2.986549 5.222757 0.065557
H  1.887434 3.899296 -0.426083
H  2.046111 4.332793 1.305522
H  -1.973231 1.652936 0.611739
H  -6.313714 1.105451 0.426853
H  -6.209229 0.013833 -1.021882
H  -6.186157 -0.695571 0.631184
