program: Gaussian 09
title: 000205845
version: EM64L-G09RevD.01
frameworkgroup: C1[X(C10H8Cl3NO2)]
method: RPBEPBE
basis: SDD
operation: Freq
keyword: #p
keyword: freq=noraman
keyword: PBEPBE/SDD
title: #p freq=noraman PBEPBE/SDD
converged: YES YES NO NO
title: Mulliken charges:
elementType: Cl Cl Cl O O N C C C C C C C C C C H H H H H H H H
charge: -0.074454 0.001246 0.003682 -0.236196 -0.190946 -0.252878 -0.366022 0.336469 -0.360249 0.183151 0.181819 -0.307842 -0.575060 -0.311982 -0.074519 -0.072664 0.255251 0.241845 0.249458 0.245878 0.289530 0.265886 0.280557 0.288040
chargesum: 0.00000
title: Mulliken charges with hydrogens summed into heavy atoms:
elementType: Cl Cl Cl O O N C C C C C C C C C C
charge: -0.074454 0.001246 0.003682 -0.236196 -0.190946 -0.252878 0.131074 0.336469 0.135088 0.183151 0.181819 -0.018312 -0.028618 -0.023942 -0.074519 -0.072664
polarizability: 1.98909577e+02 -2.89539573e+01 1.73659924e+02 5.66880804e+00 7.14328651e+00 7.29147805e+01
1716.lowfreq: -7.2800 0.0020 0.0022 0.0026 0.8926 3.3667 17.5210 31.7185 50.1932
frequency: 17.3295 31.6803 50.1759 88.5698 105.0333 116.1805 178.0686 186.6111 197.8547 221.6602 252.5637 272.3342 320.1471 345.9897 349.8682 381.1900 415.6661 429.5675 455.1947 592.3186 607.0071 618.1635 621.9811 653.6953 679.0027 683.2234 709.3147 749.6518 776.2055 844.5816 852.2035 864.3060 869.0025 916.4282 981.4659 1010.1997 1038.5779 1087.8564 1091.1931 1106.9458 1175.8992 1207.3360 1222.9163 1251.2555 1293.7181 1319.9244 1322.2744 1341.9533 1378.5961 1385.1866 1398.0321 1452.3295 1454.6887 1469.9119 1480.8050 1605.7052 1624.0692 1744.3834 2992.1569 3019.0659 3050.3465 3062.7820 3088.2284 3143.1610 3173.8885 3193.4959
redmass: 15.4759 7.9027 4.6803 12.8565 7.7793 6.6028 5.0547 23.5915 8.0630 2.3223 6.2019 3.8005 8.6921 8.2293 6.8462 6.1292 7.4700 3.1654 6.8710 4.4677 6.0552 7.5485 8.9846 6.0975 9.5226 9.1024 4.5862 5.3555 1.4145 2.4961 1.4338 1.3988 3.5246 5.2291 2.8470 2.4814 1.7869 1.8362 3.6276 2.5679 1.5058 1.8893 1.4002 2.0826 1.2758 1.2211 1.5155 4.6978 1.5832 5.0462 3.3552 1.0920 1.0973 1.9060 1.6922 10.0921 8.6144 12.0836 1.0623 1.0599 1.0863 1.0708 1.1045 1.1109 1.0940 1.0941
irintensity: 1.1782 2.0573 2.3982 2.8873 1.9975 0.3462 0.9110 0.2888 0.9389 0.5538 1.2657 1.7171 6.1844 1.7259 3.7278 1.1146 2.7054 11.4803 6.8943 15.9352 11.0845 27.4310 8.0698 23.5215 10.3321 1.4980 0.8075 16.7018 31.5443 84.1950 2.6990 57.6048 68.7872 9.5446 11.7620 27.4511 11.9858 45.4345 3.7883 1.4085 3.2972 19.9793 4.9674 54.5922 4.7669 33.1661 19.2144 51.6507 15.7544 31.0111 29.9671 5.1999 12.7500 101.4575 160.6617 70.2489 5.0210 682.0516 6.7391 15.6198 2.3180 24.6966 11.9137 9.9559 0.8962 1.6432
temp: 298.150 k
press: 1.00000 atm
elementType: 17 17 17 8 8 7 6 6 6 6 6 6 6 6 6 6 1 1 1 1 1 1 1 1
symmnumber: 1
zpe: 428389.4 jmol-1
zpe.correction: 0.163165 hartree
zpe.thermalcorrener: 0.178220 hartree
zpe.thermalcorrenthalpy: 0.179164 hartree
zpe.thermalcorrgfe: 0.117839 hartree
zpe.sumelectzpe: -1970.094307 hartree
zpe.sumelectthermal: -1970.079252 hartree
zpe.sumelectthermalent: -1970.078308 hartree
zpe.sumelectthermalfe: -1970.139633 hartree
dipole: -2.5551 -1.0706 0.9020
dipole: 2.9134
quadrupole: -108.3452 -136.6928 -111.4695
quadrupole: 5.9090 -4.2219 -0.1204
quadrupole: 10.4906 -17.8569 7.3663 5.9090 -4.2219 -0.1204
hfenergy: -1970.2574717 hartree
pointgroup: C01 [X(C10H8Cl3N1O2)]
dipole: 1.0138132 -0.4209679 -0.3298767 debye
dipolederiv: -0.2626989 -0.0302992 0.0427759 0.093803 -0.4755284 0.1382304 -0.0082524 0.1489362 -0.2656571 -0.1257602 -0.1554987 0.0012887 -0.2467696 -0.6398014 0.0204777 0.0049284 0.0254932 -0.0250883 -0.7491795 -0.1237158 -0.0820605 -0.0977283 -0.0696034 -0.008794 -0.0946404 -0.0140629 -0.0326661 -1.2933034 -0.4690035 -0.0851367 -0.2517415 -0.6273193 -0.0039216 -0.1368575 -0.02925 -0.1758802 -1.0591721 -0.6785085 -0.0580094 -0.5720329 -1.1155048 -0.0464737 -0.0463366 -0.0380794 -0.3319741 -1.0373065 -0.1003168 -0.0270262 -0.3661021 -1.0917868 -0.0503444 -0.0540115 0.0208897 -0.1914964 0.628284 -0.1996415 -0.0103925 -0.2453452 0.2042187 -0.0038114 0.0247243 0.0312694 0.2095718 0.9341376 0.4679402 0.0429599 0.3099625 -0.0566951 0.0257862 0.0885756 0.0735944 0.0648265 -0.0653832 0.0322127 -0.0111288 0.1493161 -0.0750403 0.0530702 -0.0602187 0.053701 -0.0225683 0.0807256 0.1426077 0.0018287 0.683091 0.6826272 0.0275414 -0.0465459 -0.0242247 0.0541241 1.7745727 0.8228524 0.1416824 0.546913 1.9101441 0.0217165 0.1449539 -0.0065704 0.2963211 -0.0866491 -0.0251112 0.0059101 -0.1464333 -0.1730213 0.006025 0.0224556 -0.005514 -0.1132921 0.2341305 0.0573386 -0.0086333 -0.0076604 0.6201666 -0.2237144 0.0729217 -0.2608073 0.2861747 -0.1298413 -0.0047492 -0.0056369 -0.0321547 -0.0151875 -0.0132231 -0.004453 -0.0061825 -0.0896789 -0.09455 0.150691 -0.0195219 0.3468365 0.9914756 -0.0473692 -0.0272865 -0.0577834 -0.056481 1.0296181 0.1117064 0.1398503 -0.0093086 -0.2050122 0.0126004 0.1536731 0.026589 -0.0564415 -0.0242839 -0.0131442 -0.0359426 -0.072351 0.0359629 -0.0813617 -0.0004249 -0.0293512 0.0608386 0.0491544 -0.0256029 0.0479688 0.0076199 0.0293514 0.1073535 0.033325 0.0490208 0.0182061 -0.0281022 -0.0355032 -0.0849914 -0.0680431 0.0493498 -0.0694764 -0.050675 -0.0477273 0.0338773 0.0576245 0.0403214 0.0308871 -0.0492586 -0.0494539 0.10816 0.0389791 0.0447235 0.0297996 0.0647641 0.0420878 -0.0255795 0.0423407 0.0671757 0.0102001 -0.0308102 0.0140071 0.167212 -0.0062379 -0.0497355 -0.0543346 -0.0934907 -0.0352217 0.0027062 -0.10633 0.0200959 0.0108293 0.0277709 0.0191158 0.0686933 0.0501008 -0.0216589 0.0006178 0.0991557 -0.0021503 -0.0513862 0.0816855 0.0239561 -0.015451 0.0284365 0.0603629 0.0140044 -0.0168497 0.0133829 0.1808291 unknown
polarizability: 198.4789372|29.1970914|173.701446|8.3870899|-6.9703784|73.303899 unknown
InChI: InChI=1S/C10H8Cl3NO2/c11-2-1-3-14-8-4-6(12)7(13)5-9(8)16-10(14)15/h4-5H,1-3H2
charge 0 multiplicity 1
24 atoms
Cl 3.584352 -2.918616 0.309036
Cl -2.550724 -3.099082 0.120696
Cl -4.681121 -0.663029 -0.369161
O  -0.45748 2.497921 -0.028661
O  1.837345 3.081152 0.233595
N  1.063263 0.81867 0.325815
C  2.346436 0.13225 0.526317
C  -0.198572 0.209347 0.188037
C  2.933367 -0.406157 -0.800118
C  -1.130235 1.256811 -0.024211
C  0.955933 2.213206 0.188553
C  -0.61214 -1.130029 0.23565
C  4.130025 -1.330667 -0.585408
C  -2.494008 1.026119 -0.196518
C  -1.995659 -1.378372 0.062949
C  -2.918308 -0.325693 -0.148973
H  3.039994 0.856521 0.988176
H  2.193336 -0.700442 1.236187
H  2.153518 -0.944431 -1.36945
H  3.264735 0.446043 -1.426812
H  0.082649 -1.958273 0.396603
H  4.909493 -0.894258 0.058066
H  4.563923 -1.678202 -1.533655
H  -3.205027 1.838611 -0.358716
