program: Gaussian 09
title: 000205844
version: EM64L-G09RevD.01
frameworkgroup: C1[X(C10H8BrCl2NO2)]
method: RPBEPBE
basis: SDD
operation: Freq
keyword: #p
keyword: freq=noraman
keyword: PBEPBE/SDD
title: #p freq=noraman PBEPBE/SDD
converged: YES YES NO NO
title: Mulliken charges:
elementType: Br Cl Cl O O N C C C C C C C C C C H H H H H H H H
charge: 0.069554 -0.074221 0.000817 -0.235565 -0.190839 -0.252649 -0.365814 0.335526 -0.360057 0.177252 0.182096 -0.302851 -0.575135 -0.279366 -0.056259 -0.185816 0.254925 0.242223 0.249308 0.245715 0.291166 0.265765 0.280480 0.283746
chargesum: 0.00000
title: Mulliken charges with hydrogens summed into heavy atoms:
elementType: Br Cl Cl O O N C C C C C C C C C C
charge: 0.069554 -0.074221 0.000817 -0.235565 -0.190839 -0.252649 0.131334 0.335526 0.134966 0.177252 0.182096 -0.011685 -0.028890 0.004380 -0.056259 -0.185816
polarizability: 2.19508467e+02 -3.01062777e+01 1.73984443e+02 5.24196113e+00 7.71756572e+00 7.39258400e+01
1716.lowfreq: -5.6845 -0.0019 -0.0007 -0.0007 2.9100 4.2731 16.5833 29.9469 45.2511
frequency: 16.4830 29.9174 45.2385 88.2105 102.9800 109.9562 148.8796 176.5008 194.6577 215.0938 226.6166 255.4975 311.7347 332.2131 348.1840 376.7783 399.6168 428.2182 447.2080 589.1764 593.8171 610.4264 623.3879 653.0874 679.3067 681.1418 710.7333 748.7839 776.4396 843.2637 855.2362 861.3095 868.6946 910.3084 981.4387 1010.0882 1038.4950 1082.5794 1090.3771 1106.0293 1175.9595 1205.7106 1222.9494 1249.1991 1293.4306 1319.2119 1322.0097 1340.0909 1376.9675 1380.3125 1391.8087 1452.2745 1454.7403 1468.6022 1479.9198 1603.1739 1621.7706 1743.5738 2992.0393 3019.3600 3050.2543 3062.6305 3088.1592 3142.9560 3173.5686 3194.0216
redmass: 16.1942 10.9016 4.2315 13.2448 7.2659 6.2648 17.0131 6.5159 9.2712 4.1416 2.9226 4.4076 5.0486 10.9767 6.2158 5.4444 8.8183 3.1207 6.1489 7.7922 4.6281 5.4599 9.6167 6.1556 9.6353 9.1911 4.5526 5.3290 1.4101 2.9242 1.4287 3.2432 1.4035 4.5823 2.8384 2.5149 1.7919 1.9179 3.6889 2.5217 1.5123 1.9669 1.3695 2.0363 1.2750 1.2624 1.4469 4.6121 2.3587 2.6134 2.8948 1.0954 1.0974 2.1551 1.5208 10.1396 8.6037 12.0830 1.0623 1.0598 1.0860 1.0712 1.1046 1.1108 1.0940 1.0939
irintensity: 1.0480 1.2948 3.1452 2.6551 2.4650 0.2288 0.5551 0.4356 1.4407 0.8370 0.1292 1.2867 9.0271 0.3707 0.5640 2.5502 2.3074 13.2936 6.8529 19.6469 18.3232 14.3557 2.3190 28.0556 9.8016 2.7583 1.0785 19.0246 31.1638 103.0555 5.6021 46.5755 50.1786 13.5986 11.0744 29.3363 11.8465 41.8335 1.0175 0.6745 2.8089 22.8681 6.5675 54.7371 4.6463 43.5445 9.2019 54.7393 35.5304 19.1395 24.8572 6.0993 12.6101 127.7946 149.6675 71.8571 5.8559 696.6420 6.7484 15.6307 2.4355 24.9678 12.1798 9.9874 0.8498 0.9376
temp: 298.150 k
press: 1.00000 atm
elementType: 35 17 17 8 8 7 6 6 6 6 6 6 6 6 6 6 1 1 1 1 1 1 1 1
symmnumber: 1
zpe: 427023.8 jmol-1
zpe.correction: 0.162645 hartree
zpe.thermalcorrener: 0.177944 hartree
zpe.thermalcorrenthalpy: 0.178889 hartree
zpe.thermalcorrgfe: 0.116297 hartree
zpe.sumelectzpe: -1523.493895 hartree
zpe.sumelectthermal: -1523.478595 hartree
zpe.sumelectthermalent: -1523.477651 hartree
zpe.sumelectthermalfe: -1523.540243 hartree
dipole: -2.3210 -1.1220 0.9601
dipole: 2.7510
quadrupole: -106.8258 -139.1134 -114.2713
quadrupole: 6.5337 -4.5623 -0.2308
quadrupole: 13.2444 -19.0432 5.7988 6.5337 -4.5623 -0.2308
hfenergy: -1523.6565399 hartree
pointgroup: C01 [X(C10H8Br1Cl2N1O2)]
dipole: 0.9321705 -0.430901 -0.341752 debye
dipolederiv: -0.6196958 -0.1168686 -0.070146 -0.0734282 0.0039447 -0.0083175 -0.0831967 -0.0156722 0.0077372 -0.2631218 -0.0271357 0.0408383 0.1003134 -0.4745469 0.1392566 -0.0113324 0.1500515 -0.2669222 -0.1150828 -0.140979 0.0027245 -0.2253378 -0.6482286 0.0254142 0.0062545 0.0295687 -0.0305134 -1.3280351 -0.4696328 -0.0871085 -0.2603226 -0.623367 -0.0038478 -0.1391496 -0.0281124 -0.1740579 -1.093329 -0.6801699 -0.0596831 -0.5959717 -1.1082808 -0.0475083 -0.0462956 -0.0366988 -0.3318136 -1.0782718 -0.1102155 -0.0292772 -0.4000177 -1.0912957 -0.052463 -0.0549784 0.0222402 -0.1930807 0.6387522 -0.1978428 -0.0095597 -0.2547575 0.2048597 -0.0033142 0.0256038 0.0310471 0.2093586 0.9797319 0.4631663 0.0456218 0.3201816 -0.04159 0.0257538 0.0924954 0.0714279 0.072111 -0.0684277 0.0334514 -0.0112225 0.1534526 -0.0737992 0.0534921 -0.0629235 0.0540329 -0.022808 0.0815129 0.162072 0.0003777 0.6943457 0.6674021 0.0278753 -0.048471 -0.0213111 0.0533157 1.81015 0.8236858 0.1425432 0.5813981 1.902117 0.0224689 0.1430943 -0.0101668 0.2961337 -0.0956862 -0.0387647 0.0064783 -0.1194729 -0.182331 0.0101698 0.0193456 -0.0064193 -0.1167882 0.2352328 0.0517672 -0.0062885 -0.0171506 0.6200902 -0.2254156 0.0790991 -0.2622207 0.2883417 -0.1835486 -0.0470076 -0.0111939 -0.0237862 -0.0025199 -0.0123669 -0.0145941 -0.0123855 -0.0778795 -0.1612423 0.1704583 -0.033095 0.2512899 0.9999859 -0.0618847 -0.0326905 -0.0569794 -0.0369748 1.0516289 0.1185311 0.1499169 0.0170014 -0.2787054 0.0171782 0.1630633 0.0283566 -0.1212314 -0.0268266 -0.0134932 -0.0366242 -0.0729901 0.0366405 -0.0811281 0.0001328 -0.0292081 0.0603164 0.0508354 -0.0260319 0.0482769 0.0075918 0.028763 0.1065709 0.0348174 0.0485756 0.0189373 -0.0278857 -0.0367669 -0.0837676 -0.0703278 0.0486386 -0.070196 -0.0504814 -0.0481106 0.0339282 0.0582964 0.0414385 0.0290803 -0.0483338 -0.0493253 0.1085955 0.0372188 0.0450608 0.0293825 0.0545683 0.0421962 -0.0264342 0.0396933 0.0656415 0.0100744 -0.0316075 0.0143369 0.1679205 -0.0054834 -0.0494658 -0.0540726 -0.0936907 -0.037087 0.002762 -0.1070359 0.0196188 0.0114619 0.0271648 0.0201351 0.0679184 0.0523817 -0.0213236 0.0012685 0.0989115 -0.0011991 -0.0525469 0.0787632 0.0274724 -0.0153034 0.0379379 0.0543172 0.015562 -0.0172798 0.0141671 0.1756718 unknown
polarizability: 218.1086714|31.0199723|174.7320138|10.4485474|-7.0377077|74.5780652 unknown
InChI: InChI=1S/C10H8BrCl2NO2/c11-6-4-9-8(5-7(6)13)14(3-1-2-12)10(15)16-9/h4-5H,1-3H2
charge 0 multiplicity 1
24 atoms
Br -4.826387 -0.64963 -0.380791
Cl 3.623083 -2.918461 0.309883
Cl -2.551631 -3.091829 0.133372
O  -0.438158 2.49667 -0.029107
O  1.860069 3.06686 0.230507
N  1.073102 0.80898 0.326829
C  2.354189 0.11792 0.524586
C  -0.191996 0.206946 0.190644
C  2.939397 -0.416886 -0.803854
C  -1.117758 1.258926 -0.022552
C  0.973209 2.204272 0.187198
C  -0.615724 -1.128662 0.240902
C  4.146542 -1.328685 -0.593233
C  -2.482624 1.036315 -0.193292
C  -2.001693 -1.368086 0.069537
C  -2.923349 -0.312734 -0.144146
H  3.04999 0.839084 0.98803
H  2.199801 -0.71641 1.232156
H  2.16222 -0.963657 -1.368741
H  3.259788 0.437689 -1.433051
H  0.073014 -1.961688 0.402965
H  4.925188 -0.881418 0.043814
H  4.578428 -1.674417 -1.543062
H  -3.182798 1.857799 -0.355994
