program: Gaussian 09
title: 000205835
version: EM64L-G09RevD.01
frameworkgroup: C1[X(C13H16N2O4)]
method: RPBEPBE
basis: SDD
operation: Freq
keyword: #p
keyword: freq=noraman
keyword: PBEPBE/SDD
title: #p freq=noraman PBEPBE/SDD
converged: YES YES NO NO
title: Mulliken charges:
elementType: O O O O N N C C C C C C C C C C C C C H H H H H H H H H H H H H H H H
charge: -0.222965 -0.332382 -0.245001 -0.258640 -0.395774 -0.401209 0.206599 -0.584451 0.149651 -0.714513 0.408246 0.150707 0.207030 -0.376692 -0.511125 -0.385034 0.319546 -0.533416 -0.537448 0.232342 0.246374 0.372152 0.236106 0.233200 0.236814 0.345330 0.243405 0.255050 0.255046 0.232374 0.221879 0.256191 0.251373 0.219540 0.219698
chargesum: 0.00000
title: Mulliken charges with hydrogens summed into heavy atoms:
elementType: O O O O N N C C C C C C C C C C C C C
charge: -0.222965 -0.332382 -0.245001 -0.258640 -0.023623 -0.055879 0.206599 -0.105735 0.149651 -0.008393 0.408246 0.150707 0.207030 -0.133287 -0.256076 -0.129988 0.319546 0.177029 0.153163
polarizability: 2.26038041e+02 -7.50637435e+00 1.82707603e+02 1.36329683e+01 3.93716741e+00 9.78393487e+01
1716.lowfreq: -7.3143 -6.3506 -0.0012 -0.0005 0.0003 4.8907 28.9443 39.3905 57.3060
frequency: 28.8949 39.3865 57.3012 84.1205 95.6581 116.6441 146.1482 165.5806 166.8294 171.4198 190.7596 208.7547 227.4575 239.4087 260.1517 273.1951 290.4020 324.9102 348.7426 379.7525 428.1748 445.1342 465.1548 485.8445 525.2603 534.5828 586.9961 603.4395 610.8698 615.9150 634.2545 659.5572 684.9951 698.5322 717.7622 734.0288 760.9476 794.4514 823.3000 833.8203 889.7473 891.9803 926.9043 953.8710 957.8022 980.1489 986.4448 1008.2525 1083.9519 1104.9951 1111.0240 1113.6418 1126.6769 1149.9380 1151.8540 1157.6278 1168.2439 1204.6672 1213.5980 1263.3807 1272.3991 1295.4357 1304.7569 1308.5064 1326.6864 1376.2761 1383.7366 1392.9615 1406.2866 1433.7122 1445.7269 1461.1466 1466.4008 1467.4595 1469.0765 1470.3467 1471.1755 1475.9387 1503.9174 1585.9467 1619.1501 1676.3124 1714.7818 2956.8869 2968.8259 2992.5882 2995.1748 3044.3417 3056.8755 3062.7169 3099.6071 3100.9239 3125.7003 3126.9908 3133.1165 3177.3529 3179.3553 3481.2616 3590.1279
redmass: 5.5879 4.6416 5.6362 3.3962 4.4720 3.7996 6.2499 5.9447 3.7719 3.3485 1.8164 3.4026 1.2180 1.1292 2.6441 1.8417 3.2849 2.7903 3.9430 6.7643 4.0672 3.4862 3.7989 4.1893 5.6345 3.5706 2.7594 4.0505 7.7943 2.5500 1.7024 1.5045 4.6121 6.4915 3.1345 5.8552 3.2829 2.4988 2.2128 1.6936 3.8217 2.3784 2.4041 1.5992 1.8954 2.3637 7.1172 3.8130 2.1938 2.6971 1.2598 1.2630 2.2886 1.7005 1.8736 1.4508 1.6988 2.2918 2.5965 5.7968 1.9849 1.3850 1.6931 2.4401 2.3566 1.3224 3.9224 1.3507 3.2851 1.1501 1.2699 1.1339 1.0684 1.0659 1.0530 1.1056 1.0575 1.0641 2.3636 7.3722 6.9716 8.3951 9.6585 1.0332 1.0322 1.0553 1.0390 1.1039 1.1020 1.1042 1.1007 1.1006 1.1009 1.0989 1.0900 1.0935 1.0912 1.0807 1.0803
irintensity: 0.9527 0.2232 0.6335 0.0741 1.7871 11.5841 2.5068 3.6382 2.4902 0.1824 0.7268 1.3551 0.8124 0.1356 4.9628 0.7340 2.5303 1.0051 1.8495 32.1712 3.0154 0.6315 8.0544 5.1169 3.3420 7.0894 20.3692 12.6186 12.1552 5.9656 22.0928 174.6386 2.3356 3.5545 42.9035 47.1283 20.8609 4.4021 6.3618 73.5054 15.8251 7.6531 33.1525 7.1908 12.2142 50.4362 51.8143 33.4946 7.7669 49.7440 0.2692 0.3312 72.9364 26.9462 12.5587 5.0433 36.8828 46.2168 43.9841 179.5774 50.3360 5.6288 53.3241 136.0649 69.5203 19.3885 14.5128 16.9711 2.4274 22.6532 18.9734 12.1026 17.1349 12.8236 26.8444 76.8888 6.1503 33.0956 92.3086 53.2791 135.1357 512.4420 435.2968 55.5127 57.6172 22.1785 4.1147 47.8180 6.3579 37.5946 21.0677 15.7756 17.0982 19.5862 9.9248 5.4546 4.2255 295.3257 65.1399
temp: 298.150 k
press: 1.00000 atm
elementType: 8 8 8 8 7 7 6 6 6 6 6 6 6 6 6 6 6 6 6 1 1 1 1 1 1 1 1 1 1 1 1 1 1 1 1
symmnumber: 1
zpe: 725674.3 jmol-1
zpe.correction: 0.276395 hartree
zpe.thermalcorrener: 0.294926 hartree
zpe.thermalcorrenthalpy: 0.295870 hartree
zpe.thermalcorrgfe: 0.229525 hartree
zpe.sumelectzpe: -913.986472 hartree
zpe.sumelectthermal: -913.967941 hartree
zpe.sumelectthermalent: -913.966997 hartree
zpe.sumelectthermalfe: -914.033342 hartree
dipole: 5.9791 2.4788 0.2634
dipole: 6.4779
quadrupole: -112.3786 -115.6620 -112.7683
quadrupole: 16.0749 2.2180 -2.7666
quadrupole: 1.2244 -2.0590 0.8347 16.0749 2.2180 -2.7666
hfenergy: -914.2628666 hartree
pointgroup: C01 [X(C13H16N2O4)]
dipole: 2.3554225 -0.9610415 -0.1542276 debye
polarizability: 225.2757426|7.8268066|182.813911|-16.4969296|3.5340269|98.4953393 unknown
InChI: InChI=1S/C13H16N2O4/c1-13(11(16)14-12(17)15-13)7-8-4-5-9(18-2)6-10(8)19-3/h4-6,14-15H,7H2,1-3H3
charge 0 multiplicity 1
35 atoms
O  -3.600397 2.240582 0.542278
O  0.466507 -1.671857 0.411038
O  -3.88742 -2.420712 -0.128625
O  4.798815 0.621018 -0.363074
N  -2.107136 -0.86189 -0.437328
N  -4.099176 -0.060133 0.217479
C  -1.869308 0.583176 -0.220823
C  -0.831334 0.844702 0.928634
C  -3.278137 1.066817 0.235528
C  -1.489161 1.317921 -1.527481
C  0.636416 0.727043 0.545098
C  -3.393862 -1.266136 -0.12951
C  1.285972 -0.519243 0.322932
C  1.439727 1.890508 0.434689
C  2.666872 -0.606552 0.023515
C  2.812465 1.842046 0.131506
C  3.427734 0.585069 -0.071461
C  1.10889 -2.991801 0.410387
C  5.48786 -0.65278 -0.578742
H  -1.071432 0.147831 1.754429
H  -1.02137 1.870937 1.293238
H  -1.31441 -1.51204 -0.420575
H  -0.501272 0.98155 -1.885223
H  -2.236809 1.11695 -2.31366
H  -1.449263 2.406441 -1.347472
H  -5.090503 -0.064011 0.457673
H  0.967492 2.864955 0.605644
H  3.137384 -1.578805 -0.138421
H  3.41819 2.748864 0.057064
H  1.853244 -3.06732 1.224738
H  1.589369 -3.205274 -0.563645
H  0.29223 -3.708224 0.583986
H  6.533002 -0.381588 -0.78694
H  5.066173 -1.198091 -1.445944
H  5.443544 -1.293755 0.32367
