program: Gaussian 09
title: 000205834
version: EM64L-G09RevD.01
frameworkgroup: C1[X(C13H16N2O4)]
method: RPBEPBE
basis: SDD
operation: Freq
keyword: #p
keyword: freq=noraman
keyword: PBEPBE/SDD
title: #p freq=noraman PBEPBE/SDD
converged: YES YES NO NO
title: Mulliken charges:
elementType: O O O O N N C C C C C C C C C C C C C H H H H H H H H H H H H H H H H
charge: -0.222102 -0.335980 -0.244528 -0.266301 -0.396166 -0.401187 0.200565 -0.579294 0.149423 -0.712003 0.435230 0.151315 0.191192 -0.547986 0.325390 -0.351553 -0.381279 -0.533350 -0.535764 0.233480 0.249640 0.375381 0.235539 0.233159 0.238584 0.345319 0.265896 0.237979 0.244002 0.232151 0.222783 0.252945 0.247780 0.219816 0.219924
chargesum: 0.00000
title: Mulliken charges with hydrogens summed into heavy atoms:
elementType: O O O O N N C C C C C C C C C C C C C
charge: -0.222102 -0.335980 -0.244528 -0.266301 -0.020785 -0.055867 0.200565 -0.096174 0.149423 -0.004721 0.435230 0.151315 0.191192 -0.282090 0.325390 -0.113574 -0.137277 0.174529 0.151756
polarizability: 2.28684249e+02 -1.95841704e+01 1.79096198e+02 1.17301879e+01 7.51974880e+00 9.82037378e+01
1716.lowfreq: -5.4800 0.0002 0.0007 0.0009 1.9499 5.3128 26.0453 46.2635 67.9730
frequency: 25.9838 46.2311 67.9727 84.2401 93.2443 99.0711 148.2976 155.8444 166.9103 184.2960 206.5817 221.3754 227.8232 245.2140 254.2516 263.5897 289.2130 333.0211 358.1569 378.8949 384.4476 436.5756 460.3609 500.8215 535.4328 560.1421 566.5922 603.0283 610.0791 629.2942 646.8729 670.6251 686.4098 695.6578 722.5999 732.6211 748.0454 776.7750 795.3277 881.4840 892.0135 905.6263 917.2186 932.9567 956.8989 979.9688 985.0112 1013.1747 1096.9036 1106.5474 1112.9296 1114.9179 1131.4432 1143.7844 1154.0302 1158.8167 1186.5853 1198.9594 1214.6192 1246.6068 1275.3766 1293.0204 1304.8662 1309.9303 1327.6623 1380.1528 1384.1034 1397.5425 1423.7346 1438.4923 1439.9899 1458.9513 1464.4832 1466.5597 1466.9086 1472.3649 1473.3680 1477.1725 1493.3661 1587.7441 1623.9476 1676.7424 1715.4928 2957.0607 2968.3629 2994.6584 2997.2247 3043.5104 3061.2066 3062.3734 3100.1502 3102.2686 3125.1356 3126.5537 3151.7460 3153.1193 3173.0382 3466.4346 3590.1533
redmass: 5.9709 4.9896 4.0810 3.6943 4.3462 3.8984 6.0381 3.9560 7.0269 3.3652 3.5289 1.3125 1.1342 2.7552 1.2960 2.3630 3.1990 2.5598 5.3547 5.3395 6.7309 3.2332 3.6026 4.4807 3.5727 3.8775 3.7593 4.8033 5.5671 1.6195 2.0776 1.6944 5.1898 5.8265 3.5895 5.4095 4.7769 2.9530 1.6703 2.8697 1.5933 1.4396 2.4976 2.4592 2.3973 3.1357 3.7667 4.0509 2.5378 2.6869 1.2601 1.2606 2.0411 1.5430 1.9858 1.5953 1.7776 1.9540 2.7958 3.4874 2.2002 1.4668 1.6843 2.6384 2.1131 1.3897 4.9795 1.3551 2.2094 1.3624 1.2018 1.1960 1.0699 1.0536 1.0501 1.0911 1.0744 1.1106 1.9786 7.3469 6.7831 8.4256 9.6261 1.0332 1.0321 1.0377 1.0568 1.1038 1.1042 1.1020 1.1010 1.1005 1.1009 1.0990 1.0907 1.0881 1.0956 1.0808 1.0803
irintensity: 0.3379 0.9917 3.0274 0.5609 0.6233 1.8786 3.0932 11.9095 2.3196 0.9666 0.7964 0.5727 0.2294 0.8574 1.0979 3.8753 4.8785 0.4629 0.2033 1.0848 31.3286 3.8247 4.4808 6.4302 2.9094 3.1838 11.5211 3.6135 19.0922 4.4549 77.3131 111.8468 31.6715 2.9806 78.2215 22.1760 18.2912 11.4952 55.2563 0.5776 18.7271 1.2430 7.9970 27.2777 21.2921 61.0026 8.1771 76.1060 12.5726 23.6315 0.1242 0.7123 16.8570 1.2577 8.4996 4.0715 139.2968 120.6344 116.8354 38.7595 2.6737 36.5116 36.3973 153.5008 74.7084 18.7476 9.5773 20.2053 61.4247 1.3790 10.4001 9.4520 11.7516 20.4632 11.8807 51.2793 55.5576 39.9574 119.4792 21.8680 24.6032 500.2288 455.5128 69.7797 60.0364 19.0610 4.5311 50.1234 37.2603 7.1287 26.3294 10.8360 17.4731 21.1701 6.2863 5.6378 10.6031 334.8496 65.2896
temp: 298.150 k
press: 1.00000 atm
elementType: 8 8 8 8 7 7 6 6 6 6 6 6 6 6 6 6 6 6 6 1 1 1 1 1 1 1 1 1 1 1 1 1 1 1 1
symmnumber: 1
zpe: 725938.2 jmol-1
zpe.correction: 0.276495 hartree
zpe.thermalcorrener: 0.294994 hartree
zpe.thermalcorrenthalpy: 0.295938 hartree
zpe.thermalcorrgfe: 0.229712 hartree
zpe.sumelectzpe: -913.985383 hartree
zpe.sumelectthermal: -913.966884 hartree
zpe.sumelectthermalent: -913.965940 hartree
zpe.sumelectthermalfe: -914.032166 hartree
dipole: 6.3320 3.2139 0.7192
dipole: 7.1373
quadrupole: -106.9760 -112.9913 -112.7613
quadrupole: 9.7759 4.5436 -2.7906
quadrupole: 3.9335 -2.0818 -1.8518 9.7759 4.5436 -2.7906
hfenergy: -914.2618783 hartree
pointgroup: C01 [X(C13H16N2O4)]
dipole: 2.5293273 1.1467633 0.4153626 debye
polarizability: 226.2865039|-22.4245962|179.8205813|14.5773801|10.5851738|99.877099 unknown
InChI: InChI=1S/C13H16N2O4/c1-13(11(16)14-12(17)15-13)7-8-6-9(18-2)4-5-10(8)19-3/h4-6,14-15H,7H2,1-3H3
charge 0 multiplicity 1
35 atoms
O  -2.813256 -2.723082 -0.795602
O  0.017034 2.10998 -0.166148
O  -4.393025 1.620568 0.151308
O  4.179471 -1.692519 -0.041987
N  -2.260507 0.590024 0.443412
N  -3.935901 -0.676318 -0.350481
C  -1.62937 -0.717114 0.154804
C  -0.522366 -0.60984 -0.953194
C  -2.836471 -1.531822 -0.400958
C  -1.108905 -1.412583 1.434904
C  0.848032 -0.139974 -0.483461
C  -3.599773 0.648574 0.103393
C  1.118847 1.215766 -0.119556
C  1.916054 -1.057095 -0.430994
C  3.221444 -0.665505 -0.04067
C  2.415221 1.616479 0.262065
C  3.475552 0.680179 0.304452
C  0.290378 3.544054 -0.016376
C  5.546883 -1.335978 0.340524
H  -0.907573 0.064237 -1.741961
H  -0.420917 -1.618566 -1.392978
H  -1.67222 1.428607 0.508075
H  -0.273429 -0.839973 1.871969
H  -1.914218 -1.488448 2.185295
H  -0.753759 -2.429259 1.19223
H  -4.882822 -0.925386 -0.636377
H  1.752502 -2.103922 -0.707521
H  2.622014 2.655636 0.533561
H  4.47259 1.015494 0.603638
H  1.019782 3.885871 -0.774238
H  0.663799 3.778561 0.998904
H  -0.67785 4.04079 -0.178549
H  6.119344 -2.2721 0.267572
H  5.588758 -0.953741 1.379486
H  5.974953 -0.582395 -0.349543
