program: Gaussian 09
title: 000205831
version: EM64L-G09RevD.01
frameworkgroup: C1[X(C23H28O4)]
method: RPBEPBE
basis: SDD
operation: Freq
keyword: #pfreq=noraman
keyword: PBEPBE/SDD
title: #p freq=noraman PBEPBE/SDD
converged: YES YES NO NO
title: Mulliken charges:
elementType: O O O O C C C C C C C C C C C C C C C C C C C C C C C H H H H H H H H H H H H H H H H H H H H H H H H H H H H
charge: -0.263701 -0.233528 -0.270243 -0.262663 -0.041844 -0.400798 -0.392522 -0.393643 -0.315937 -0.359833 -0.712484 -0.701307 0.154791 0.229502 0.119130 -0.375933 -0.329834 -0.220258 0.198967 -0.222939 -0.493255 0.482282 -0.392296 -0.367246 -0.226385 -0.229339 -0.231676 0.202403 0.193105 0.217664 0.195282 0.205047 0.194532 0.222586 0.234106 0.230558 0.196286 0.198569 0.222642 0.216263 0.213345 0.212355 0.209300 0.213518 0.263163 0.274326 0.238217 0.236942 0.246851 0.223320 0.233753 0.269393 0.228077 0.230523 0.230867
chargesum: 0.00000
title: Mulliken charges with hydrogens summed into heavy atoms:
elementType: O O O O C C C C C C C C C C C C C C C C C C C C C C C
charge: -0.263701 -0.233528 -0.270243 -0.262663 0.160559 0.009971 0.007806 0.023474 0.148726 0.035023 -0.060235 -0.066134 0.154791 0.229502 0.119130 -0.112770 -0.055508 0.017959 0.198967 0.014004 -0.023084 0.482282 -0.158543 -0.097852 0.001693 0.001183 -0.000809
polarizability: 2.99611391e+02 -7.70504236e+00 2.70060855e+02 -2.24699090e+01 -7.13391255e+00 2.13606655e+02
1716.lowfreq: -7.4483 -5.7927 -0.0009 -0.0005 0.0002 5.2226 10.9582 12.8472 21.0789
frequency: 6.9573 12.4579 21.0280 26.9051 39.1363 40.0646 47.4346 60.4459 82.6194 84.8428 91.2713 104.2174 111.7093 134.0093 148.5465 150.2475 163.9327 192.4882 216.4757 225.7351 231.2288 240.2787 258.3415 260.8780 287.5895 306.1526 317.3024 337.4948 361.5056 385.3752 392.5900 404.0564 415.4776 427.9402 471.8825 484.4916 517.5780 536.1770 557.9645 593.1345 616.9448 641.0685 668.8601 678.1599 700.8801 704.9888 729.0827 753.6560 761.9221 769.5503 775.3490 781.7394 788.3069 798.7457 817.4743 845.0538 859.5465 872.8721 887.0151 890.6384 904.3309 916.9028 929.9065 936.7413 974.2131 975.6380 978.7476 983.3968 990.2006 1002.2462 1003.7903 1010.0990 1021.6596 1027.0572 1032.0796 1033.5790 1054.9766 1060.4353 1076.3772 1081.8056 1091.1562 1119.3780 1132.2428 1157.6196 1173.9625 1175.5615 1177.4210 1189.4310 1200.4535 1221.3094 1222.9204 1227.2746 1232.6360 1243.6745 1246.8727 1268.7298 1278.4082 1281.0852 1287.2813 1302.9403 1328.7361 1330.4576 1346.3491 1348.5173 1350.4760 1363.4429 1375.2820 1381.0396 1385.2841 1386.5337 1395.2231 1429.1435 1442.2761 1458.4638 1466.5057 1469.1516 1471.2187 1474.4110 1476.0370 1477.6724 1479.9525 1483.7706 1484.4571 1488.3635 1497.7785 1577.7981 1593.8188 1601.1446 1612.8649 1614.4332 1618.6032 2959.0848 2961.6662 2967.8972 2969.0443 2970.9546 2977.9437 2986.2596 2999.1868 3003.5412 3019.3988 3021.5120 3043.1225 3044.6002 3063.4515 3067.6742 3068.8396 3071.6647 3079.1862 3116.4527 3120.1243 3129.2952 3137.6636 3141.2502 3152.1894 3152.7948 3166.0370 3167.4557 3182.0436
redmass: 4.6448 3.8988 5.2990 5.0983 4.8308 4.0130 5.1751 4.0595 4.6589 1.8062 3.7053 3.9563 2.3703 3.1521 3.7395 5.6578 2.1731 3.4206 5.0164 2.6477 1.4856 2.3040 2.2186 3.7927 4.0112 4.3577 2.1157 3.7077 4.4281 2.9265 3.1756 2.8247 3.6242 4.6803 2.5576 4.1883 5.3682 2.2875 4.3446 4.5959 6.3186 6.3729 6.1439 5.7977 4.1881 1.8915 1.0828 2.6839 3.0405 1.2954 2.9237 1.8033 1.7968 2.2251 3.5682 2.6276 1.2751 5.6346 1.7984 2.4749 1.7209 1.6061 1.6885 1.4941 1.6407 1.5484 1.8440 1.4256 5.3263 1.3356 1.3529 1.8713 5.5068 2.3394 1.8044 3.1258 2.0400 2.5530 3.3254 1.9306 1.5287 1.8355 2.1410 1.9676 1.0543 2.2218 1.0614 1.1178 1.2381 2.8943 1.3900 2.8978 1.2703 1.5070 2.0190 1.2433 1.4549 1.1894 1.2208 1.1045 1.4674 1.2589 1.4320 1.3012 1.4283 1.5530 1.5151 9.0235 7.9791 1.2284 1.2104 2.2025 2.1735 1.1248 1.0664 1.0773 1.1289 1.0499 1.9764 1.1255 1.0805 1.0908 2.2112 1.0838 1.0667 7.3090 6.1207 6.9404 8.9296 6.1449 11.3993 1.0591 1.0739 1.0604 1.0426 1.0573 1.0379 1.0656 1.0960 1.0578 1.0993 1.0996 1.0577 1.1025 1.1003 1.1067 1.0994 1.0999 1.0998 1.1065 1.0883 1.0873 1.0863 1.0920 1.0964 1.0913 1.1016 1.0970 1.0972
irintensity: 0.2038 0.1972 0.2359 0.5557 0.7149 0.3937 0.9665 0.1955 0.0580 0.5287 2.9049 0.2197 0.2651 0.6089 1.7166 0.7174 1.0398 1.0295 1.6117 3.8582 2.2619 0.3143 0.4894 6.7357 2.0864 6.0651 0.6429 0.0652 12.7674 0.9611 6.3084 0.0606 0.1355 0.2324 3.7735 6.4175 6.4965 2.9637 1.3680 22.5297 0.4205 3.4291 6.3484 7.9083 60.9591 56.7683 23.3948 50.1285 31.6902 8.9500 7.0098 8.9988 29.8311 1.8103 8.0318 5.7050 1.2770 44.7777 7.1395 8.6533 1.9921 29.0447 0.8972 1.3609 1.8633 1.6479 1.0394 0.6612 2.7315 0.1524 1.4933 6.1930 251.5760 9.8333 41.0701 70.5465 4.1834 3.8210 216.3237 4.9864 9.9600 54.3061 4.7527 1.5023 0.0614 0.7862 1.7518 2.9697 2.7690 55.5577 11.7323 170.3730 35.7540 56.5672 197.2548 1.9493 27.5085 14.9422 3.2214 0.3492 0.6844 1.3895 2.0218 26.3531 1.4656 3.1120 0.7060 10.9573 0.5681 9.8732 13.3892 9.1109 9.4122 29.6944 2.6947 4.3670 2.0748 9.1693 20.1141 1.8605 9.9598 17.8853 8.9321 23.9952 6.9626 31.0956 6.8464 51.0211 139.6578 9.5746 128.5187 6.5216 19.7059 14.0627 23.2070 57.9166 26.3787 60.2110 5.3223 25.1875 29.6490 5.3430 29.4617 64.3993 127.7507 24.6186 50.3861 58.8695 62.4638 2.7544 7.0266 1.5804 1.7470 17.9352 24.2385 11.2105 22.4496 15.1077 10.0409
temp: 298.150 k
press: 1.00000 atm
elementType: 8 8 8 8 6 6 6 6 6 6 6 6 6 6 6 6 6 6 6 6 6 6 6 6 6 6 6 1 1 1 1 1 1 1 1 1 1 1 1 1 1 1 1 1 1 1 1 1 1 1 1 1 1 1 1
symmnumber: 1
zpe: 1197844.1 jmol-1
zpe.correction: 0.456235 hartree
zpe.thermalcorrener: 0.483797 hartree
zpe.thermalcorrenthalpy: 0.484742 hartree
zpe.thermalcorrgfe: 0.392893 hartree
zpe.sumelectzpe: -1192.145985 hartree
zpe.sumelectthermal: -1192.118422 hartree
zpe.sumelectthermalent: -1192.117478 hartree
zpe.sumelectthermalfe: -1192.209327 hartree
dipole: 1.4875 -0.5141 -2.7252
dipole: 3.1470
quadrupole: -140.6753 -149.5440 -163.7641
quadrupole: 3.2915 -0.9081 -8.5095
quadrupole: 10.6525 1.7838 -12.4363 3.2915 -0.9081 -8.5095
hfenergy: -1192.6022197 hartree
pointgroup: C01 [X(C23H28O4)]
dipole: -0.6047797 -0.2775725 1.0440789 debye
polarizability: 301.0979954|5.5264953|262.6380669|-20.7277513|19.9973713|219.5428378 unknown
InChI: InChI=1S/C23H28O4/c1-3-5-11-18(4-2)16-26-22(24)20-14-9-10-15-21(20)23(25)27-17-19-12-7-6-8-13-19/h6-10,12-15,18H,3-5,11,16-17H2,1-2H3
charge 0 multiplicity 1
55 atoms
O  2.464956 0.638871 0.022617
O  2.446194 2.31726 -1.600664
O  -1.483619 0.109088 1.359526
O  -0.27679 0.163385 -0.639953
C  3.88638 -1.362102 -0.047599
C  2.809401 -2.197904 0.699229
C  4.815697 -2.203019 -0.969674
C  1.822835 -2.986958 -0.193304
C  3.278795 -0.225396 -0.883787
C  0.826871 -3.824318 0.642847
C  5.591612 -3.313931 -0.230691
C  -0.187626 -4.600527 -0.224679
C  2.038811 1.84798 -0.511635
C  1.120338 2.571486 0.4342
C  -0.070372 1.998397 0.967624
C  1.486102 3.88716 0.803389
C  -0.843953 2.738701 1.898268
C  0.708296 4.618076 1.72708
C  -0.57971 0.685169 0.462134
C  -0.4537 4.037242 2.284845
C  -2.161281 -1.162078 0.905999
C  -3.46295 -0.867968 0.194544
C  -4.684992 -0.846914 0.913658
C  -3.476614 -0.6151 -1.202326
C  -5.902578 -0.573309 0.251569
C  -4.693033 -0.33975 -1.864401
C  -5.908278 -0.318909 -1.139841
H  4.52591 -0.889174 0.728145
H  3.322315 -2.905452 1.38148
H  2.230592 -1.509182 1.34492
H  5.543622 -1.519238 -1.452703
H  4.222312 -2.65056 -1.792005
H  2.373958 -3.669078 -0.872546
H  1.251856 -2.286702 -0.835322
H  2.60136 -0.594977 -1.675667
H  4.060317 0.398527 -1.355191
H  1.393089 -4.5360 1.278467
H  0.28766 -3.15257 1.342295
H  4.914424 -4.088116 0.172714
H  6.303451 -3.815858 -0.911316
H  6.169539 -2.897573 0.616032
H  0.331683 -5.293141 -0.913811
H  -0.792567 -3.910986 -0.844411
H  -0.882317 -5.198121 0.394321
H  2.387447 4.326748 0.364635
H  -1.758616 2.288386 2.292329
H  1.00779 5.633206 2.008542
H  -1.060949 4.598772 3.002486
H  -1.453461 -1.707477 0.259894
H  -2.319573 -1.70237 1.85239
H  -4.68113 -1.045253 1.992714
H  -2.531307 -0.624132 -1.756337
H  -6.842211 -0.561906 0.815078
H  -4.694616 -0.14434 -2.942408
H  -6.852169 -0.108468 -1.655298
