program: Gaussian 09
title: 000205827
version: EM64L-G09RevD.01
frameworkgroup: C1[X(C12H15N2O)]
method: RPBEPBE
basis: SDD
operation: Freq
keyword: #p
keyword: freq=noraman
keyword: PBEPBE/SDD
title: #p freq=noraman PBEPBE/SDD
converged: NO YES NO NO
title: Mulliken charges:
elementType: O N N C C C C C C C C C C C C H H H H H H H H H H H H H H H
charge: -0.225160 -0.059018 -0.009724 0.314814 0.281986 -0.349566 -0.158898 -0.155046 -0.280746 -0.265046 0.250839 -0.450343 -0.488856 -0.627279 -0.659447 0.254238 0.250758 0.288258 0.291595 0.267509 0.307912 0.277331 0.258369 0.236724 0.239051 0.265843 0.240871 0.212514 0.251223 0.239295
chargesum: 1.00000
title: Mulliken charges with hydrogens summed into heavy atoms:
elementType: O N N C C C C C C C C C C C C
charge: -0.225160 -0.059018 -0.009724 0.314814 0.281986 0.155429 0.129360 0.136549 -0.013237 0.042867 0.250839 -0.173013 0.006237 0.118486 0.043585
polarizability: 2.81141932e+02 1.93381262e+00 1.30185425e+02 1.01306206e+01 -4.34657289e+00 8.07072288e+01
1716.lowfreq: -26.3955 -0.0002 0.0007 0.0007 4.3580 6.4128 17.3745 40.3011 43.4233
frequency: -12.7292 40.0151 43.3897 66.9771 95.8904 108.7281 168.3097 197.2813 216.3037 227.7588 301.4571 308.9213 363.5730 384.3524 404.7335 425.6998 466.4605 523.2524 579.7732 632.0930 645.8818 660.4990 687.4694 736.1517 765.3674 785.4142 790.7575 823.2885 852.7160 859.1363 873.1991 919.4518 945.4855 970.1323 974.4204 991.4085 1004.9455 1012.5214 1039.9823 1056.0981 1071.5611 1077.6961 1084.5857 1155.9735 1157.7516 1193.2953 1223.6966 1234.1103 1250.6017 1258.1673 1314.2781 1328.1551 1334.8942 1379.6736 1386.6075 1394.5005 1402.3298 1427.1380 1463.8000 1467.5667 1468.3778 1469.9376 1477.5531 1480.1283 1485.6680 1502.5364 1540.8801 1592.8423 1643.1539 2995.9071 3002.7995 3006.4502 3036.3087 3068.7120 3089.8296 3096.8311 3106.7702 3107.9836 3114.8303 3181.7452 3185.0669 3198.7831 3203.5394 3237.9676
redmass: 2.6137 3.0242 3.2348 4.6129 3.3011 3.3390 3.9759 1.3764 1.1418 2.6482 5.3465 2.4258 3.0394 3.0391 2.7900 4.9495 4.0026 3.4941 4.2547 5.1315 4.2060 6.0729 2.9302 3.6714 4.8480 1.2189 1.1298 9.7048 1.3691 1.4260 1.5234 8.4783 3.5595 2.2933 1.3690 1.3587 2.9901 2.8081 2.7120 1.9569 1.6431 1.6888 2.0942 4.3583 1.4662 1.6224 1.2040 1.5834 1.2256 2.6545 1.4234 1.5858 1.2572 2.6905 2.5560 1.3540 1.1895 3.2568 2.1481 1.0787 1.0512 1.3860 1.0518 1.3082 1.1379 1.4613 6.3192 6.8602 5.5453 1.0361 1.0365 1.0626 1.0604 1.0993 1.1043 1.1001 1.1013 1.0996 1.1048 1.0901 1.0914 1.0986 1.1012 1.0996
irintensity: 0.6500 0.1025 0.7017 3.4247 0.9997 0.7708 0.3263 0.9049 0.3508 0.5562 2.5340 2.4120 0.0589 1.9324 0.0222 1.4473 0.8385 21.5522 2.5800 8.7317 3.3709 0.4278 0.6217 0.2798 3.9904 3.2893 2.6977 8.4119 34.1987 61.1833 6.3340 29.2838 17.8926 4.7434 0.0436 0.2863 0.7451 5.1598 0.3031 10.1908 8.5925 3.6737 13.9320 151.0764 3.4724 1.9801 23.2265 1.9953 0.1973 2.2122 13.4783 1.5955 4.7430 36.1850 17.3519 7.3149 11.9281 53.8677 15.6274 9.0277 27.6968 9.6491 16.3479 25.3955 54.2583 46.7451 15.6858 49.8214 429.4230 18.6291 4.1686 11.6169 11.0444 0.5718 0.7647 35.1210 21.5688 12.9286 14.7200 0.0599 1.3853 4.2347 1.7043 1.1613
temp: 298.150 k
press: 1.00000 atm
elementType: 8 7 7 6 6 6 6 6 6 6 6 6 6 6 6 1 1 1 1 1 1 1 1 1 1 1 1 1 1 1
symmnumber: 1
zpe: 651069.3 jmol-1
zpe.correction: 0.247979 hartree
zpe.thermalcorrener: 0.261529 hartree
zpe.thermalcorrenthalpy: 0.262473 hartree
zpe.thermalcorrgfe: 0.206659 hartree
zpe.sumelectzpe: -649.633598 hartree
zpe.sumelectthermal: -649.620049 hartree
zpe.sumelectthermalent: -649.619105 hartree
zpe.sumelectthermalfe: -649.674918 hartree
dipole: -8.5899 -3.8104 -0.2708
dipole: 9.4010
quadrupole: -11.9636 -77.4661 -87.3014
quadrupole: -7.8847 4.5956 -2.1920
quadrupole: 46.9468 -18.5557 -28.3910 -7.8847 4.5956 -2.1920
hfenergy: -649.8815776 hartree
pointgroup: C01[X(C12H15N2O1)]
dipole: 3.3898935 1.4552609 -0.2659683 debye
polarizability: 281.2291072|-0.1996555|130.5165747|-9.4432561|-1.4293653|80.2889042 unknown
InChI: InChI=1S/C12H15N2O/c1-3-11-9-12(15-13-11)10-5-7-14(4-2)8-6-10/h5-9H,3-4H2,1-2H3
charge 1 multiplicity 1
30 atoms
O  -1.566663 -1.510731 0.166712
N  3.179036 0.107288 -0.346628
N  -3.017116 -1.431544 0.328269
C  0.378086 -0.082046 -0.039685
C  -1.05821 -0.200779 0.110524
C  4.679479 0.207207 -0.454788
C  2.415888 1.251568 -0.255408
C  2.574558 -1.130682 -0.28158
C  1.031017 1.184484 -0.1056
C  1.19448 -1.250967 -0.131684
C  -3.304636 -0.099018 0.354237
C  -2.114397 0.699506 0.222236
C  -4.736682 0.346986 0.490956
C  5.352922 0.211027 0.930103
C  -5.25445 1.077707 -0.776311
H  5.022746 -0.646792 -1.063135
H  4.908754 1.130642 -1.013177
H  2.950562 2.202305 -0.310762
H  3.230586 -2.000626 -0.357855
H  0.466547 2.117725 -0.043349
H  0.739919 -2.243482 -0.088416
H  -2.072774 1.786334 0.216314
H  -5.361009 -0.540048 0.695696
H  -4.824016 1.016317 1.367643
H  5.027619 1.070413 1.540874
H  6.445702 0.285207 0.796905
H  5.143386 -0.716606 1.489595
H  -4.664043 1.984952 -0.997777
H  -6.302448 1.386889 -0.626225
H  -5.216739 0.416465 -1.658582
