program: Gaussian 09
title: 000205821
version: EM64L-G09RevD.01
frameworkgroup: C1[X(C18H27NO4)]
method: RPBEPBE
basis: SDD
operation: Freq
keyword: #p
keyword: freq=noraman
keyword: PBEPBE/SDD
title: #p freq=noraman PBEPBE/SDD
converged: YES YES NO NO
title: Mulliken charges:
elementType: O O O O N C C C C C C C C C C C C C C C C C C H H H H H H H H H H H H H H H H H H H H H H H H H H H
charge: -0.193984 -0.283831 -0.248848 -0.266271 -0.067952 -0.040480 -0.424151 -0.417480 -0.368945 -0.386331 -0.338839 -0.740531 -0.516408 0.117542 0.061844 0.275724 0.243241 -0.543685 -0.564073 0.360591 -0.533520 -0.532319 -0.535556 0.204750 0.182089 0.207224 0.206935 0.183980 0.208386 0.176489 0.177552 0.214783 0.186104 0.236659 0.219588 0.212142 0.210669 0.269076 0.252505 0.265251 0.256907 0.228348 0.245066 0.222231 0.251965 0.221858 0.213948 0.247396 0.219902 0.222459
chargesum: 0.00000
title: Mulliken charges with hydrogens summed into heavy atoms:
elementType: O O O O N C C C C C C C C C C C C C C C C C C
charge: -0.193984 -0.283831 -0.248848 -0.266271 -0.067952 0.164269 -0.034839 -0.026564 0.015930 0.006004 0.083924 -0.098131 0.005172 0.117542 0.061844 0.275724 0.243241 -0.278434 -0.307166 0.360591 0.162125 0.155452 0.154200
polarizability: 2.83725261e+02 2.48214627e+00 2.26480734e+02 2.23491445e+01 -1.32860282e+00 1.57632443e+02
1716.lowfreq: -10.2676 -8.5223 0.0001 0.0004 0.0008 3.6300 9.9045 15.9499 25.9153
frequency: 5.2680 14.7053 25.7794 49.5442 54.2723 71.9519 78.1156 89.3862 103.5412 120.9831 145.0608 163.4481 164.9673 176.5458 180.1524 193.6110 197.9273 201.4154 226.4723 236.8819 256.6636 266.5538 275.5870 279.9991 307.2236 348.3481 351.4620 362.5428 372.0235 398.2268 440.8750 447.8215 461.7280 493.4575 501.9513 530.0269 559.0964 585.1069 599.8123 628.0200 635.0554 657.3410 732.0201 744.7796 764.6705 787.6747 795.3876 802.3263 816.6678 839.7410 872.9022 880.0361 899.9439 954.1707 965.7253 973.5570 977.7725 989.9225 1001.5581 1017.3063 1034.5938 1036.4767 1072.9625 1077.5701 1091.6675 1102.6736 1109.9090 1112.2381 1113.1527 1113.5715 1139.9005 1152.2555 1152.9994 1155.0934 1159.1896 1165.2208 1171.5202 1188.5956 1193.4985 1216.3617 1235.0375 1253.4971 1283.0080 1292.8323 1303.6525 1306.7821 1312.5076 1330.7232 1337.1505 1350.4404 1354.7028 1370.2211 1384.8888 1388.1075 1395.8139 1409.1266 1431.1198 1431.4096 1445.5793 1446.9682 1448.0814 1454.7344 1462.9811 1464.6543 1466.8609 1467.1641 1469.0430 1470.2229 1472.9151 1474.7239 1475.0271 1487.8271 1488.0236 1489.6508 1587.3695 1601.1829 1613.4662 2825.3262 2836.4089 2863.5565 2957.2479 2960.0902 2962.4582 2964.7173 2972.3069 2974.1225 2977.4615 2988.8990 3020.5910 3029.9951 3036.7855 3037.4575 3041.8180 3046.1418 3047.9139 3055.0796 3055.3924 3063.0885 3070.7398 3125.8107 3126.2779 3127.2187 3186.7378 3188.5632
redmass: 3.2764 3.8092 4.8742 4.2391 3.3511 3.6556 3.0726 3.4191 3.4586 3.7906 3.9639 3.2408 2.8484 1.1876 1.8858 2.6230 2.4236 2.7548 1.8485 1.2468 1.9135 2.4780 2.4552 2.4026 3.6916 2.1897 4.4694 2.3250 2.2367 2.5245 4.2525 3.8681 3.1638 4.2530 4.6688 4.3709 4.4831 4.2342 4.5665 2.6597 2.0046 3.1228 3.7324 2.4574 2.9520 1.6806 1.7175 1.6419 2.7859 2.4855 6.3028 2.2603 7.0687 2.2055 2.0665 1.4829 2.3660 8.3253 2.8678 1.6833 3.1515 1.9242 2.3409 1.9320 4.1655 2.1525 1.2574 1.2588 1.2673 2.2857 1.9033 1.8756 1.5488 2.0470 1.4095 1.6586 1.2803 1.8840 1.2567 1.5576 1.8698 1.2578 1.2572 1.4002 4.1190 1.9361 1.5082 1.5903 1.3725 1.4372 1.3637 1.4350 5.9555 1.2769 1.3914 2.4229 1.1121 1.1736 1.2517 1.0886 1.4663 1.0826 1.4441 1.0866 1.0565 1.0503 1.0554 1.0735 1.0537 1.0657 1.0723 1.7129 1.1155 1.0601 8.6905 7.1923 8.4462 1.0714 1.0702 1.0704 1.0333 1.0330 1.0756 1.0326 1.0368 1.0646 1.0597 1.0691 1.0866 1.0877 1.0954 1.0943 1.1019 1.1036 1.1040 1.1037 1.0924 1.0991 1.0984 1.0993 1.1001 1.0990 1.0900 1.0913
irintensity: 0.5865 0.3072 1.0807 1.4217 4.6650 5.8044 6.0279 2.5440 0.5457 0.1564 1.0372 0.7647 1.6903 0.2860 1.7138 1.9628 5.4527 4.4954 0.3363 0.1483 2.4816 0.9939 1.5449 2.1686 4.8504 3.6894 1.9874 3.8400 1.8081 1.5074 14.0642 1.1364 1.0737 1.6517 7.5936 9.8222 2.0312 1.9431 20.5061 13.3778 8.5795 1.8954 5.1067 10.1079 1.6747 3.9293 3.3303 3.4637 21.5859 57.4337 0.9327 4.7087 13.2038 3.3549 41.7600 0.7228 54.6235 10.6042 0.4602 3.1737 22.7302 15.3755 10.7090 15.0680 218.3908 65.3638 0.1739 0.0830 0.5822 70.1942 142.3824 9.1566 46.7662 4.8857 21.9579 37.3937 33.1290 18.3277 1.4063 77.9482 54.2661 2.7102 18.5777 12.6362 95.9557 41.7303 2.5248 45.4018 8.6884 20.6888 1.2673 27.4099 35.3399 31.0655 5.9675 73.6260 14.9935 20.0432 11.0956 8.9829 55.3782 5.1358 22.7297 1.7733 2.1628 10.1924 27.1606 6.9149 60.8199 2.9198 23.5923 6.9503 21.0202 3.7089 137.8998 423.7780 186.3051 44.4710 106.3995 126.9382 40.7786 96.8559 7.6024 58.1115 40.5562 19.5487 48.2794 89.2731 55.6223 37.0635 0.8842 6.6414 90.2890 34.7919 56.5298 42.4225 17.4318 44.7185 56.9276 28.7003 19.9973 13.8334 4.9549 1.5098
temp: 298.150 k
press: 1.00000 atm
elementType: 8 8 8 8 7 6 6 6 6 6 6 6 6 6 6 6 6 6 6 6 6 6 6 1 1 1 1 1 1 1 1 1 1 1 1 1 1 1 1 1 1 1 1 1 1 1 1 1 1 1
symmnumber: 1
zpe: 1104358.2 jmol-1
zpe.correction: 0.420628 hartree
zpe.thermalcorrener: 0.445585 hartree
zpe.thermalcorrenthalpy: 0.446529 hartree
zpe.thermalcorrgfe: 0.362612 hartree
zpe.sumelectzpe: -1055.910161 hartree
zpe.sumelectthermal: -1055.885204 hartree
zpe.sumelectthermalent: -1055.884259 hartree
zpe.sumelectthermalfe: -1055.968176 hartree
dipole: -3.5618 1.1707 -2.8476
dipole: 4.7081
quadrupole: -107.5040 -121.9836 -146.5626
quadrupole: 11.0517 7.9594 8.0410
quadrupole: 17.8461 3.3665 -21.2126 11.0517 7.9594 8.0410
hfenergy: -1056.3307883 hartree
pointgroup: C01 [X(C18H27N1O4)]
dipole: 1.3975747 -0.1243775 -1.2092726 debye
polarizability: 281.5860612|11.5957879|224.8489426|-24.3209883|12.3609022|161.4034349 unknown
InChI: InChI=1S/C18H27NO4/c1-13-5-8-19(9-6-13)10-7-15(20)18-16(22-3)11-14(21-2)12-17(18)23-4/h11-13H,5-10H2,1-4H3
charge 0 multiplicity 1
50 atoms
O  0.21683 1.087663 2.184119
O  1.208151 -2.007345 0.353038
O  2.057363 2.681665 0.456664
O  5.545121 -0.453665 -1.146139
N  -3.40421 0.378169 0.013712
C  -6.116701 -0.345904 -1.001279
C  -4.802615 -0.919211 -1.598829
C  -5.797973 1.010393 -0.314901
C  -3.654735 -0.964883 -0.568165
C  -4.624795 0.903195 0.680003
C  -2.234944 0.402274 0.928717
C  -6.819355 -1.343864 -0.047935
C  -0.901209 0.24656 0.179091
C  0.317001 0.582353 1.034003
C  1.676753 0.333384 0.410464
C  2.127092 -0.977236 0.08784
C  2.57294 1.410013 0.179237
C  3.41819 -1.21555 -0.427253
C  3.876705 1.204509 -0.341819
C  4.282632 -0.117274 -0.633984
C  1.63724 -3.386371 0.107511
C  2.943355 3.836696 0.314573
C  6.502428 0.631606 -1.369364
H  -6.815326 -0.148017 -1.840649
H  -4.977145 -1.937654 -1.999501
H  -4.479568 -0.278349 -2.442364
H  -5.523646 1.752202 -1.090242
H  -6.694135 1.39246 0.213016
H  -2.733087 -1.31321 -1.068603
H  -3.888193 -1.712507 0.236844
H  -4.920621 0.261947 1.552091
H  -4.390466 1.905452 1.085356
H  -2.309555 -0.381951 1.72465
H  -2.225865 1.375194 1.452079
H  -6.188384 -1.607742 0.820095
H  -7.761735 -0.915862 0.34312
H  -7.067927 -2.283188 -0.577323
H  -0.756703 -0.769842 -0.230007
H  -0.893928 0.934587 -0.692888
H  3.785404 -2.215796 -0.664116
H  4.542561 2.050213 -0.520914
H  2.516245 -3.646671 0.727412
H  0.778651 -4.008644 0.399579
H  1.87335 -3.550447 -0.961636
H  2.335605 4.698566 0.625937
H  3.828596 3.747941 0.973639
H  3.269228 3.971484 -0.735903
H  7.407372 0.140473 -1.755918
H  6.123982 1.355623 -2.117251
H  6.739228 1.159859 -0.42531
