program: Gaussian 09
title: 000213713
version: EM64L-G09RevD.01
frameworkgroup: C1[X(C20H22O7)]
method: RPBEPBE
basis: SDD
operation: Freq
keyword: #pfreq=noraman
keyword: PBEPBE/SDD
title: #p freq=noraman PBEPBE/SDD
converged: YES YES NO NO
title: Mulliken charges:
elementType: O O O O O O O C C C C C C C C C C C C C C C C C C C C H H H H H H H H H H H H H H H H H H H H H H
charge: -0.285881 -0.265494 -0.239930 -0.291475 -0.288565 -0.404718 -0.255243 0.247257 0.467478 -0.672446 0.081838 0.540006 -0.492054 -0.671321 -0.594257 0.195176 0.199217 -0.508324 -0.479842 0.228427 0.165860 -0.341876 0.221170 -0.540275 -0.496400 -0.543636 -0.521363 0.262422 0.220973 0.267310 0.257538 0.292635 0.261523 0.290612 0.237568 0.250581 0.218502 0.251801 0.242671 0.225535 0.248247 0.228905 0.263891 0.223545 0.230801 0.374686 0.209186 0.226337 0.261401
chargesum: 0.00000
title: Mulliken charges with hydrogens summed into heavy atoms:
elementType: O O O O O O O C C C C C C C C C C C C C C C C C C C C
charge: -0.285881 -0.265494 -0.239930 -0.291475 -0.288565 -0.030032 -0.255243 0.247257 0.467478 -0.189051 0.081838 0.540006 -0.224744 -0.121148 -0.332734 0.195176 0.199217 -0.217712 -0.242274 0.228427 0.165860 -0.091295 0.221170 0.172699 0.206287 0.174600 0.175562
polarizability: 2.67023899e+02 -1.01220436e+01 2.78240810e+02 1.08235699e+01 4.46081016e+00 2.11428998e+02
1716.lowfreq: -9.1358 -4.4794 -0.0006 0.0004 0.0005 6.2054 16.2447 24.5461 28.7483
frequency: 16.2055 24.4447 28.7061 32.8003 39.5612 54.5570 61.9399 65.1031 86.9266 91.5319 102.7435 106.5577 114.8906 135.1310 159.5986 167.6178 171.4823 186.6231 198.6097 207.9408 218.5035 241.1674 259.0074 268.1210 273.8075 292.6918 297.3154 312.0630 324.8923 361.4311 366.0944 369.1835 394.7942 437.9154 457.7288 466.1052 474.8928 486.2195 496.9094 519.2100 534.7712 539.5343 573.5253 592.0853 611.7355 629.3879 646.0351 682.3850 694.2229 720.2691 723.3976 729.9788 736.3105 766.6347 799.7649 820.4464 852.7656 858.0461 871.1135 893.6206 914.1396 919.6800 933.5620 936.9967 945.6805 958.9929 985.7858 993.0032 1028.1054 1053.4171 1104.1296 1106.9213 1107.6496 1111.9609 1112.8098 1122.3715 1142.1710 1149.0842 1155.7038 1158.1708 1162.2168 1171.7740 1193.3342 1199.6152 1213.1923 1251.2436 1255.7640 1264.8954 1271.8785 1283.9079 1290.3928 1302.6882 1344.1170 1376.4994 1378.2694 1398.7925 1404.8989 1427.7093 1428.9943 1439.7056 1443.4406 1449.3176 1451.8247 1454.8322 1455.9479 1463.5784 1466.8050 1468.2367 1474.4042 1475.4262 1482.1175 1502.1601 1507.3689 1538.3086 1572.7540 1581.8558 1610.2985 1616.6648 1660.8492 2964.1731 2973.6738 2981.3196 2984.5199 3000.6761 3001.1403 3043.3710 3056.1108 3072.8749 3080.9796 3083.2388 3111.2562 3119.2600 3126.0292 3127.3689 3130.7221 3133.0828 3148.7707 3149.2827 3160.7309 3182.4555 3517.5778
redmass: 4.9623 4.2009 3.6973 4.9097 5.7661 2.6020 5.4624 5.2049 4.8504 2.7582 3.5226 4.0060 9.8672 2.6047 1.4285 1.8331 2.8031 2.3183 3.0453 2.8588 3.3360 3.1371 2.0475 1.4245 2.4154 6.8397 3.9471 3.7052 3.9123 4.5775 5.3241 4.1048 4.6685 4.7815 3.1520 3.0862 3.4702 3.6022 3.0994 4.6357 4.3478 5.3987 4.8564 5.0316 3.8302 1.7368 4.3037 6.3759 4.5622 5.1116 5.1758 3.5454 3.7474 3.2813 3.8514 1.5202 2.0941 2.6749 1.4742 1.7891 3.9794 6.8044 1.7326 2.0132 2.2904 8.0177 6.6207 4.6560 3.7153 2.5259 1.3846 1.2781 1.6868 1.2422 1.2654 2.5180 1.7226 1.4333 1.4119 1.3973 1.5382 1.7027 1.7087 1.2940 1.8500 2.3231 1.9032 2.7313 1.4930 1.6186 1.9054 3.0237 2.1771 5.5973 5.4350 3.3751 2.2095 1.2227 1.1588 1.2080 1.2196 1.4062 1.1315 1.0824 1.0585 1.0542 1.0571 1.0497 1.0971 1.0844 1.0546 2.6347 3.4764 6.5673 9.3136 7.9118 6.0446 6.6343 8.2617 1.0329 1.0351 1.0325 1.0609 1.0621 1.0314 1.0990 1.1040 1.0943 1.1020 1.0964 1.1031 1.0895 1.1048 1.1002 1.1031 1.1059 1.0911 1.0914 1.0948 1.0893 1.0640
irintensity: 1.3148 1.0537 1.2205 3.0196 2.1884 2.0026 5.2100 6.3928 2.9999 0.6511 4.3821 2.0303 4.4074 0.5359 1.5032 2.5239 1.5227 1.0559 3.7728 1.2669 1.4416 0.5164 1.4988 0.4646 4.1320 4.2226 11.4752 2.3807 4.8915 2.4659 2.6784 0.9969 1.5148 4.0412 4.0610 8.1173 2.9506 13.1187 30.8641 14.8598 33.3752 5.2839 7.2086 3.4987 0.3159 100.2103 46.8182 4.0616 38.2376 9.0918 13.9839 1.0978 8.8848 34.0610 4.8813 28.2745 11.6368 23.5945 22.9903 12.8306 11.1820 42.8056 9.2425 23.4197 0.1861 44.1447 21.9333 56.0025 0.4769 389.3913 24.3748 6.8722 65.4714 7.5808 2.7818 137.4881 29.1177 54.9923 9.8010 18.6386 16.8275 29.8171 17.0626 8.3059 71.4175 93.3990 35.7527 115.4276 37.0032 74.4910 45.0126 390.9885 39.0721 16.8120 14.7586 15.3867 20.8851 2.8432 53.1099 2.3115 10.6556 5.6358 38.5789 3.2910 13.2137 33.5294 35.9617 12.1729 70.6271 40.9544 25.7287 120.0285 13.2798 421.9352 30.8736 14.9915 20.7855 83.7620 237.3739 41.6166 103.7238 42.0473 18.2243 26.5240 70.2875 8.3087 31.5182 1.5887 20.8334 41.1734 32.3129 14.6965 16.9660 22.8409 23.7822 22.5309 0.0600 5.7912 10.3275 3.3599 27.5143
temp: 298.150 k
press: 1.00000 atm
elementType: 8 8 8 8 8 8 8 6 6 6 6 6 6 6 6 6 6 6 6 6 6 6 6 6 6 6 6 1 1 1 1 1 1 1 1 1 1 1 1 1 1 1 1 1 1 1 1 1 1
symmnumber: 1
zpe: 1001705.5 jmol-1
zpe.correction: 0.381529 hartree
zpe.thermalcorrener: 0.409472 hartree
zpe.thermalcorrenthalpy: 0.410416 hartree
zpe.thermalcorrgfe: 0.320500 hartree
zpe.sumelectzpe: -1299.842430 hartree
zpe.sumelectthermal: -1299.814487 hartree
zpe.sumelectthermalent: -1299.813543 hartree
zpe.sumelectthermalfe: -1299.903460 hartree
dipole: -0.6823 -2.1335 -0.0389
dipole: 2.2403
quadrupole: -151.4816 -140.4750 -154.9878
quadrupole: 12.3885 1.3893 -14.8343
quadrupole: -2.5001 8.5064 -6.0063 12.3885 1.3893 -14.8343
hfenergy: -1300.2239595 hartree
pointgroup: C01 [X(C20H22O7)]
dipole: 0.3654828 0.802033 -0.0054243 debye
polarizability: 265.1132189|-8.4230782|280.4878614|-10.5884754|-2.8509843|211.0926259 unknown
InChI: InChI=1S/C20H22O7/c1-24-16-6-5-12(8-17(16)25-2)7-15(21)14-11-19(27-4)18(26-3)9-13(14)10-20(22)23/h5-6,8-9,11,22H,7,10H2,1-4H3
charge 0 multiplicity 1
49 atoms
O  2.063611 3.207131 -0.071613
O  4.103776 1.784164 -1.617681
O  0.61094 -2.445254 1.864369
O  -3.218326 -0.233658 -1.905814
O  -4.49928 2.161385 -1.013932
O  1.513842 -4.665233 -0.566799
O  0.315894 -2.788233 -1.199858
C  1.41106 -0.414008 0.824185
C  2.391298 -1.053611 -0.003324
C  -0.668213 -0.473445 2.429384
C  0.485238 -1.188651 1.700443
C  -1.681234 0.204319 1.507079
C  1.327925 1.006055 0.803972
C  2.552707 -2.558806 -0.10744
C  3.250295 -0.24345 -0.769149
C  2.172077 1.807001 0.014843
C  3.183396 1.170277 -0.774226
C  -1.992359 -0.366034 0.24753
C  -2.330253 1.399056 1.897507
C  -2.92599 0.244895 -0.620249
C  -3.602587 1.437566 -0.207801
C  -3.289344 1.996377 1.048907
C  1.334516 -3.281527 -0.667831
C  0.936806 3.838572 0.62608
C  4.465133 3.209998 -1.477239
C  -2.475772 -1.416849 -2.373189
C  -5.611468 1.42179 -1.64643
H  -1.161623 -1.258977 3.03116
H  -0.26304 0.270066 3.144084
H  0.549067 1.490843 1.394797
H  3.406813 -2.802325 -0.768463
H  2.757258 -3.020546 0.872954
H  4.015552 -0.696081 -1.408362
H  -1.470053 -1.273125 -0.073478
H  -2.108397 1.853509 2.87073
H  -3.814433 2.912523 1.337915
H  1.027757 3.720693 1.723509
H  -0.029864 3.422089 0.284771
H  1.000441 4.904498 0.362791
H  4.733677 3.44704 -0.433334
H  3.638941 3.860897 -1.800555
H  5.339921 3.328954 -2.134808
H  -1.385091 -1.249545 -2.341741
H  -2.719251 -2.30729 -1.763513
H  -2.812111 -1.565971 -3.409803
H  0.70769 -5.126027 -0.925255
H  -6.235794 0.931091 -0.874311
H  -6.20014 2.191878 -2.16829
H  -5.232509 0.669983 -2.356926
