program: Gaussian 09
title: 000205815
version: EM64L-G09RevD.01
frameworkgroup: C1[X(C15H21NO4)]
method: RPBEPBE
basis: SDD
operation: Freq
keyword: #p
keyword: freq=noraman
keyword: PBEPBE/SDD
title: #p freq=noraman PBEPBE/SDD
converged: YES YES NO NO
title: Mulliken charges:
elementType: O O O O N C C C C C C C C C C C C C C C H H H H H H H H H H H H H H H H H H H H H
charge: -0.246500 -0.234931 -0.261753 -0.256124 -0.083362 -0.329130 -0.346569 -0.353697 -0.324889 -0.319118 -0.535906 0.109683 0.167009 0.252371 -0.323287 -0.517149 -0.413966 0.361593 -0.526395 -0.535570 0.186980 0.206994 0.217096 0.190628 0.186911 0.251780 0.193219 0.213572 0.214698 0.194519 0.230339 0.251292 0.233043 0.279985 0.245049 0.229836 0.284077 0.209411 0.223347 0.225098 0.249815
chargesum: 0.00000
title: Mulliken charges with hydrogens summed into heavy atoms:
elementType: O O O O N C C C C C C C C C C C C C C C
charge: -0.246500 -0.234931 -0.261753 -0.256124 -0.083362 0.064844 0.061155 0.084994 0.081902 0.090099 -0.054275 0.109683 0.167009 0.252371 -0.090244 -0.237164 -0.168917 0.361593 0.196929 0.162690
polarizability: 2.44888413e+02 2.27629774e+01 2.12660856e+02 5.17050959e-01 -2.78716498e+00 1.23439744e+02
1716.lowfreq: -3.5226 -0.0004 0.0002 0.0008 0.1177 7.5485 15.7378 23.4752 39.4150
frequency: 15.4946 23.2919 39.0599 67.1703 68.7540 92.1680 104.7473 130.4231 144.2495 174.9794 183.7579 193.6151 213.8880 224.3998 237.8567 256.0340 274.5211 289.9931 310.4115 318.8679 358.1651 371.4224 394.5735 429.5686 458.4749 459.8327 470.9129 515.8179 546.8394 585.6715 603.3771 634.0477 656.1073 697.0691 709.2897 745.9514 782.4793 798.5478 800.7516 815.7262 839.4579 861.6989 879.5581 899.8001 931.7706 973.0617 987.5897 998.7877 1012.4423 1026.2509 1034.7551 1049.7815 1055.0163 1087.1502 1101.6116 1110.0180 1112.7051 1127.3386 1128.0183 1145.9309 1146.3979 1160.6710 1185.4989 1188.1209 1194.8729 1238.5502 1241.7739 1248.8327 1264.8568 1278.9509 1287.5496 1295.9518 1299.2012 1326.3314 1341.3455 1356.3069 1370.3436 1375.2565 1383.3995 1413.9860 1432.6785 1442.4925 1443.6547 1446.3125 1448.5887 1451.4739 1456.4693 1466.1389 1468.4571 1471.2233 1473.9905 1480.4257 1490.4764 1533.9867 1569.4748 1623.6792 2838.4566 2849.7403 2868.1961 2954.9872 2959.6493 2966.4509 2977.2806 3014.0077 3029.0737 3032.0035 3037.0015 3057.2700 3079.5024 3081.2306 3083.7862 3087.7904 3122.3433 3130.0436 3145.6809 3175.0371 3184.8466
redmass: 5.3043 3.0709 4.6618 3.8578 3.9391 3.7456 3.7410 3.6236 4.2159 3.0092 1.5535 2.9486 1.2852 4.9678 1.7827 2.9912 3.0522 3.3055 2.3137 3.8417 4.1751 3.4122 2.1093 5.9284 3.4333 3.3469 3.0223 5.0137 5.1317 2.1530 3.9154 3.9672 3.8095 5.7061 4.2590 3.1248 2.1221 1.6339 1.8528 3.5215 1.6076 5.8480 1.6475 2.4162 1.3526 6.1270 4.1173 3.0119 2.7200 2.2670 3.0434 2.4486 1.8133 3.8218 2.1019 1.2585 1.2610 2.4499 1.8056 1.9990 1.6800 1.4996 1.6083 1.0944 1.5477 1.6134 1.5825 2.2112 1.3157 1.7458 1.3606 1.4354 1.5474 1.2847 1.2352 1.4038 1.2715 3.3958 1.4264 3.6107 1.2329 1.0819 1.2830 1.0823 1.0954 1.1927 1.0961 1.2297 1.0504 1.0664 1.0910 1.2431 1.6753 6.0559 8.0002 6.7673 1.0706 1.0701 1.0690 1.0664 1.0664 1.0327 1.0327 1.0597 1.0885 1.0895 1.0876 1.1043 1.0966 1.1022 1.0980 1.0990 1.1053 1.0998 1.0872 1.0950 1.0922
irintensity: 0.2216 0.3407 2.0187 0.9953 3.2210 5.7159 3.0751 3.2955 1.1994 0.5502 1.7981 4.3214 1.9203 3.0305 2.0791 10.0829 3.9546 1.4029 13.2276 10.1983 2.4303 2.9238 1.0538 7.5529 3.7421 5.5608 0.5986 1.3154 39.6417 16.1426 18.1575 9.7754 2.1871 5.0900 5.0146 5.2272 20.7396 13.9416 8.5862 19.8692 0.4797 0.5982 41.8939 13.8549 0.4021 16.3563 38.0467 7.1703 45.8843 9.4774 31.0284 12.9380 18.4967 59.4741 4.3716 0.3987 2.8025 80.2196 185.6784 15.9972 4.5458 107.2406 48.0607 11.6291 52.8642 104.8074 15.4009 185.2807 12.2375 31.5322 25.9907 22.1750 61.0740 13.3372 12.1640 1.9583 3.8631 63.9779 11.3072 4.2579 5.7914 3.1713 29.1602 2.5283 19.9548 14.6690 5.9136 5.0951 14.4273 66.8196 22.8190 36.8109 50.8665 203.2555 121.4916 338.5548 51.2131 67.4299 137.4319 33.0896 103.6099 67.0014 51.9763 5.8188 42.1300 36.9433 11.3970 43.9532 35.4509 27.3019 36.6563 29.1143 19.2122 24.3526 8.5657 9.9648 0.4110
temp: 298.150 k
press: 1.00000 atm
elementType: 8 8 8 8 7 6 6 6 6 6 6 6 6 6 6 6 6 6 6 6 1 1 1 1 1 1 1 1 1 1 1 1 1 1 1 1 1 1 1 1 1
symmnumber: 1
zpe: 888425.5 jmol-1
zpe.correction: 0.338383 hartree
zpe.thermalcorrener: 0.358527 hartree
zpe.thermalcorrenthalpy: 0.359471 hartree
zpe.thermalcorrgfe: 0.287660 hartree
zpe.sumelectzpe: -938.236261 hartree
zpe.sumelectthermal: -938.216117 hartree
zpe.sumelectthermalent: -938.215173 hartree
zpe.sumelectthermalfe: -938.286985 hartree
dipole: -1.0720 -3.2091 1.8785
dipole: 3.8700
quadrupole: -133.7481 -109.2248 -117.8452
quadrupole: 17.5128 -5.1148 4.8803
quadrupole: -13.4754 11.0479 2.4275 17.5128 -5.1148 4.8803
hfenergy: -938.5746442 hartree
pointgroup: C01 [X(C15H21N1O4)]
dipole: -0.4784384 -1.4309299 0.2042408 debye
polarizability: 247.0412177|19.5740834|199.5668266|7.7704931|29.0098736|134.3809685 unknown
InChI: InChI=1S/C15H21NO4/c1-18-12-3-4-13(15(11-12)19-2)14(17)5-6-16-7-9-20-10-8-16/h3-4,11H,5-10H2,1-2H3
charge 0 multiplicity 1
41 atoms
O  5.887236 -1.458302 -0.320767
O  -0.099548 2.551427 0.449701
O  -3.083034 2.38582 1.219623
O  -5.033134 -1.437288 -0.684427
N  3.419321 0.044956 0.023882
C  3.494479 -1.402491 0.350069
C  4.385315 0.375374 -1.05809
C  2.049348 0.503505 -0.30302
C  4.93063 -1.780267 0.750106
C  5.807845 -0.020534 -0.632141
C  1.117962 0.52573 0.936157
C  -0.179415 1.294958 0.64186
C  -1.466506 0.555317 0.521865
C  -2.775201 1.149033 0.660728
C  -1.420616 -0.785317 0.030981
C  -3.923899 0.446113 0.234274
C  -2.556252 -1.495037 -0.384183
C  -3.823823 -0.85406 -0.298274
C  -2.229034 3.017986 2.237279
C  -4.995898 -2.802835 -1.219458
H  3.17828 -2.031959 -0.521913
H  2.818832 -1.625548 1.196221
H  4.347942 1.464353 -1.249715
H  4.13188 -0.152735 -2.012345
H  1.586453 -0.116772 -1.114851
H  2.117613 1.540009 -0.680896
H  5.20992 -1.236296 1.678286
H  5.02533 -2.866719 0.913138
H  6.529449 0.144984 -1.449115
H  6.107121 0.57222 0.25894
H  0.918134 -0.489095 1.318392
H  1.651354 1.086591 1.726151
H  -0.444176 -1.267478 -0.079896
H  -4.904575 0.913123 0.352781
H  -2.451784 -2.509128 -0.778005
H  -2.912546 3.663663 2.810348
H  -1.430864 3.603158 1.754541
H  -1.778978 2.25575 2.901951
H  -4.600466 -3.516691 -0.471718
H  -4.390069 -2.854609 -2.144273
H  -6.043229 -3.047207 -1.448093
