program: Gaussian 09
title: 000205813
version: EM64L-G09RevD.01
frameworkgroup: C1[X(C18H22O4)]
method: RPBEPBE
basis: SDD
operation: Freq
keyword: #pfreq=noraman
keyword: PBEPBE/SDD
title: #p freq=noraman PBEPBE/SDD
converged: YES YES NO NO
title: Mulliken charges:
elementType: O O O O C C C C C C C C C C C C C C C C C C H H H H H H H H H H H H H H H H H H H H H H
charge: -0.298791 -0.299048 -0.253996 -0.254658 -0.012558 -0.010820 -0.446756 -0.452219 -0.446275 -0.453226 -0.428536 -0.438417 -0.429629 -0.436905 0.185169 0.185044 0.228263 0.228751 -0.342516 -0.341590 -0.341213 -0.341980 0.262774 0.263255 0.240283 0.228296 0.201754 0.241634 0.238761 0.228820 0.202023 0.241878 0.218308 0.216516 0.227224 0.219419 0.218350 0.215951 0.227348 0.218481 0.272938 0.272317 0.272458 0.273118
chargesum: 0.00000
title: Mulliken charges with hydrogens summed into heavy atoms:
elementType: O O O O C C C C C C C C C C C C C C C C C C
charge: -0.298791 -0.299048 -0.253996 -0.254658 0.250216 0.252435 0.021823 -0.008831 0.021306 -0.009325 0.006288 0.008226 0.004673 0.008924 0.185169 0.185044 0.228263 0.228751 -0.069578 -0.069273 -0.068755 -0.068862
polarizability: 3.11254788e+02 3.85631398e+00 1.94562860e+02 -3.01141835e-01 3.06250437e-01 1.35085459e+02
1716.lowfreq: -7.3657 -0.0004 0.0004 0.0004 1.4284 17.2920 21.8869 28.7776 30.9670
frequency: 21.8169 28.6899 30.8926 45.0185 50.5382 59.4315 68.9527 73.3473 88.7929 95.0861 113.6429 163.6026 192.0537 201.4424 231.8175 257.3165 282.4121 296.0118 356.5550 395.1624 399.4645 407.7178 453.6254 472.4308 489.5764 496.7311 569.0371 571.8211 628.6012 660.7232 662.3842 683.0477 696.3432 702.8945 770.1668 774.1112 777.7614 790.4014 800.7393 801.5998 822.4682 849.6632 850.7111 875.2768 888.9747 891.4883 893.0162 906.1005 906.9252 939.0600 939.8406 941.8000 942.4655 1005.7438 1008.2009 1010.8737 1014.0531 1015.3629 1060.5865 1061.9636 1062.4776 1062.7318 1088.9954 1091.2131 1113.9485 1159.9335 1160.3486 1162.9573 1163.4164 1178.2655 1193.9678 1196.8643 1216.8142 1219.0610 1235.3872 1254.0107 1256.4601 1258.7430 1287.4850 1288.1217 1298.3226 1304.8815 1305.9357 1316.3532 1316.5981 1318.6839 1319.6971 1337.9574 1339.3829 1384.8970 1406.8497 1451.1450 1451.3059 1459.3998 1459.7208 1468.8098 1469.3280 1482.7677 1483.5693 1491.6803 1566.4996 1604.7127 1614.3320 1620.6101 2998.0738 2998.7586 2999.2199 2999.2510 3005.4379 3006.5154 3022.8088 3023.0186 3056.3699 3056.4990 3067.1920 3067.7579 3071.9548 3072.4875 3082.6955 3082.7155 3090.9369 3091.2642 3156.6454 3156.9988 3179.1555 3182.8502
redmass: 4.5302 3.3894 3.2621 3.4952 2.8553 3.4523 3.6195 7.3095 5.1462 3.3095 4.2484 2.4629 2.3855 5.3814 4.9780 5.9645 7.1396 3.1158 2.4813 3.4911 3.7591 2.8684 3.1340 4.0760 7.8612 3.5244 2.0276 2.0706 7.1021 4.0943 6.0249 2.5865 3.7738 3.1984 2.3941 2.4877 4.3104 5.2643 2.4569 2.4230 6.2373 2.0858 2.0806 1.2409 1.7225 2.8111 2.8004 2.2512 2.2470 1.8182 1.7739 1.9486 2.0867 1.3530 3.5477 1.3775 1.4995 1.4905 2.8061 2.1174 2.1628 6.7495 1.6153 1.6359 1.3775 1.4015 1.3937 1.6424 1.6555 1.1425 1.4156 1.4404 1.5211 1.4444 2.2973 2.1973 1.4916 1.4511 1.3349 1.3360 1.2690 1.2585 1.2501 1.4078 1.4270 1.4875 1.4828 1.4255 1.4526 5.7469 4.1123 1.0886 1.0889 1.0806 1.0799 1.0859 1.0852 1.0989 1.0979 2.5797 8.8421 12.1330 9.5284 6.7277 1.0613 1.0613 1.0651 1.0650 1.0627 1.0627 1.0636 1.0637 1.0970 1.0969 1.0918 1.0917 1.1019 1.1019 1.1006 1.1006 1.1035 1.1035 1.0893 1.0893 1.0953 1.0968
irintensity: 0.8103 0.1524 0.0990 0.0991 0.0404 0.4435 0.2675 1.8264 0.2056 0.4347 3.8817 1.2909 0.4011 0.7369 14.9433 11.1308 0.3354 1.6271 0.1310 10.9889 4.4386 0.0003 0.4127 0.1756 10.7600 0.0022 4.0999 0.7568 0.0061 0.1821 0.0968 2.5823 50.0853 11.4590 7.4764 5.1883 2.4315 4.4562 18.8593 2.4012 0.1050 11.7585 6.5455 0.0072 38.2444 6.7437 7.3521 5.5836 5.5721 93.1656 18.4620 7.5335 9.0599 0.7562 167.6199 0.4157 1.7098 1.8443 470.2688 41.5859 81.1790 10.7294 5.0356 4.8455 18.4724 58.7056 27.9749 1.8692 4.2717 0.4821 6.0444 10.2438 189.8703 2.7092 621.5936 2.9668 12.7616 7.4151 0.3469 0.2749 0.0446 0.8638 0.6315 5.5208 1.8525 1.6178 1.2723 10.1692 7.8440 15.1227 28.0154 17.4767 18.6064 3.9943 4.2977 10.1106 10.0992 9.1177 8.6761 17.5656 0.0042 381.5823 0.0615 0.0205 38.8462 37.9422 23.3108 27.1318 34.8715 36.1933 23.3491 23.5531 29.2334 29.5233 5.2912 3.8978 24.7979 22.3742 6.2021 20.0005 130.9692 63.7262 0.1333 0.1509 4.4338 0.0250
temp: 298.150 k
press: 1.00000 atm
elementType: 8 8 8 8 6 6 6 6 6 6 6 6 6 6 6 6 6 6 6 6 6 6 1 1 1 1 1 1 1 1 1 1 1 1 1 1 1 1 1 1 1 1 1 1
symmnumber: 1
zpe: 956292.3 jmol-1
zpe.correction: 0.364232 hartree
zpe.thermalcorrener: 0.384954 hartree
zpe.thermalcorrenthalpy: 0.385898 hartree
zpe.thermalcorrgfe: 0.310930 hartree
zpe.sumelectzpe: -998.395159 hartree
zpe.sumelectthermal: -998.374438 hartree
zpe.sumelectthermalent: -998.373494 hartree
zpe.sumelectthermalfe: -998.448462 hartree
dipole: -0.0067 -0.0024 0.4935
dipole: 0.4935
quadrupole: -95.2276 -139.2344 -129.5706
quadrupole: -11.1968 -0.0743 0.1206
quadrupole: 26.1166 -17.8902 -8.2264 -11.1968 -0.0743 0.1206
hfenergy: -998.7593917 hartree
pointgroup: C01 [X(C18H22O4)]
dipole: -0.0023909 0.0112636 -0.193832 debye
polarizability: 310.8687082|-7.7408337|194.7521207|0.0973636|3.4311126|135.282278 unknown
InChI: InChI=1S/C18H22O4/c19-17(21-15-5-1-2-6-15)13-9-11-14(12-10-13)18(20)22-16-7-3-4-8-16/h9-12,15-16H,1-8H2
charge 0 multiplicity 1
44 atoms
O  3.687559 -0.214053 0.466675
O  -3.675082 0.169985 0.462674
O  2.904753 -2.407994 0.306749
O  -2.884485 2.36543 0.547076
C  5.107759 -0.723242 0.425946
C  -5.092556 0.688777 0.467192
C  5.552688 -0.945954 -1.047574
C  5.975148 0.431145 0.953951
C  -5.537303 1.031132 -0.983503
C  -5.969448 -0.494844 0.908282
C  6.413176 0.301254 -1.436775
C  6.19022 1.327545 -0.290392
C  -6.446977 -0.151461 -1.451372
C  -6.223775 -1.277926 -0.403761
C  2.679979 -1.173182 0.39118
C  -2.663824 1.127915 0.49841
C  1.316883 -0.558159 0.427537
C  -1.30206 0.509474 0.477351
C  0.193419 -1.423264 0.366055
C  -1.110162 -0.894458 0.391658
C  1.124798 0.845596 0.515804
C  -0.178536 1.374445 0.539486
H  5.136494 -1.645231 1.030312
H  -5.112734 1.560306 1.142463
H  4.665705 -1.058177 -1.693827
H  6.128081 -1.884542 -1.133867
H  6.943563 0.015249 1.29514
H  5.502973 0.945209 1.807898
H  -4.647952 1.147308 -1.626073
H  -6.072912 1.996417 -1.004305
H  -6.924865 -0.096287 1.302692
H  -5.490484 -1.087163 1.705874
H  6.132856 0.7098 -2.423119
H  7.482888 0.024042 -1.488324
H  7.03421 2.029809 -0.174813
H  5.27698 1.921977 -0.479555
H  -6.209217 -0.479874 -2.478069
H  -7.508615 0.15991 -1.443529
H  -7.079577 -1.971763 -0.333055
H  -5.326084 -1.870647 -0.661541
H  0.368174 -2.501778 0.298419
H  -1.983112 -1.550703 0.345615
H  1.997728 1.501615 0.564147
H  -0.353376 2.453059 0.604766
