program: Gaussian 09
title: 000205809
version: EM64L-G09RevD.01
frameworkgroup: C1[X(C12H17N3O4)]
method: RPBEPBE
basis: SDD
operation: Freq
keyword: #p
keyword: freq=noraman
keyword: PBEPBE/SDD
title: #p freq=noraman PBEPBE/SDD
converged: YES YES NO NO
title: Mulliken charges:
elementType: O O O O N N N C C C C C C C C C C C C H H H H H H H H H H H H H H H H H
charge: -0.224565 -0.233757 -0.228172 -0.307125 -0.356753 -0.365495 -0.373057 0.096615 -0.400596 -0.058118 -0.556137 0.184999 0.175124 -0.754569 -0.019366 0.167029 0.285748 -0.595236 -0.780813 0.237999 0.208035 0.281602 0.253457 0.237464 0.234183 0.207743 0.237559 0.300484 0.359686 0.354384 0.258401 0.221803 0.219895 0.260764 0.213789 0.256994
chargesum: 0.00000
title: Mulliken charges with hydrogens summed into heavy atoms:
elementType: O O O O N N N C C C C C C C C C C C C
charge: -0.224565 -0.233757 -0.228172 -0.307125 -0.056269 -0.005809 -0.018673 0.096615 0.045438 0.223485 -0.065216 0.184999 0.175124 -0.075084 0.239034 0.167029 0.285748 -0.153538 -0.049265
polarizability: 1.56276584e+02 -2.27114854e+01 1.83075418e+02 6.42548870e+00 2.24633704e+00 1.42172738e+02
1716.lowfreq: -10.3723 -6.1724 0.0004 0.0008 0.0009 7.0427 35.4198 46.1791 54.7659
frequency: 35.3809 46.1538 54.7285 68.6463 77.1967 82.4634 101.2684 111.6822 130.3193 152.1182 174.3361 178.3003 182.0543 211.9544 220.4462 246.8024 266.0499 295.6339 332.5021 361.7563 365.3563 387.8451 425.8784 451.7649 472.8319 491.4066 497.2684 554.6292 586.3612 593.0548 606.5491 619.3910 633.8133 642.4438 675.9591 724.9520 747.9825 762.1440 783.1130 835.7862 850.7428 893.7609 916.9707 919.8303 953.3501 960.5592 967.7255 989.0597 993.8487 1008.4383 1016.8813 1041.9802 1093.9358 1097.4737 1128.0095 1155.9711 1166.4406 1205.7021 1237.9211 1264.7193 1279.0384 1295.9782 1301.7355 1312.2893 1328.2069 1355.9144 1363.6487 1370.1705 1375.5667 1378.3065 1385.9412 1391.3934 1428.5694 1433.9851 1448.5106 1459.6459 1464.3812 1474.0915 1477.1695 1495.6783 1589.4392 1611.5158 1647.9278 1657.6011 1677.9675 2973.0134 2976.8290 2995.8554 3013.3640 3044.0038 3048.7309 3071.8305 3080.0294 3087.1293 3089.2739 3097.0338 3112.9571 3113.6793 3196.8544 3524.8792 3526.8650 3543.1585
redmass: 4.3343 6.4475 3.3004 2.9074 1.6244 3.0329 3.1120 4.2100 3.9589 4.3995 4.6301 5.2029 4.3093 1.7450 2.1462 2.6989 3.3497 2.2977 3.3279 10.2237 3.8970 6.4396 2.3767 2.3894 2.7070 6.2319 4.3850 1.4556 4.6643 2.7927 2.6300 2.6996 3.2251 2.5397 2.3154 3.5608 2.1590 3.8539 2.1031 2.4743 2.0225 1.8713 2.9542 2.3281 1.3825 2.2682 2.2795 2.1217 2.9142 1.1873 1.7011 1.6579 2.2989 2.7595 2.7020 2.9418 2.7072 3.4878 1.3355 1.7173 1.4114 1.3140 1.3356 1.5537 2.4318 1.4773 1.3975 3.4866 1.8300 2.0519 1.2475 1.2166 1.1667 1.1097 1.0852 1.1059 1.0932 1.0829 1.0511 1.9552 5.6448 6.7408 7.9388 4.7020 5.5724 1.0614 1.0386 1.0365 1.0603 1.0857 1.0992 1.0989 1.0988 1.0604 1.0987 1.0994 1.0996 1.0941 1.1143 1.0758 1.0777 1.0780
irintensity: 0.5739 2.8531 4.4043 0.7098 1.6259 4.0817 5.2072 2.8470 0.1800 2.6444 20.5711 1.3903 2.3037 0.5521 0.9104 5.7193 0.1152 3.1957 7.1090 25.8937 7.6712 2.7598 2.4863 4.1592 7.6211 13.5653 23.7174 99.9437 4.7215 0.7929 7.2854 3.3020 7.3462 3.3440 44.2557 21.4719 11.9248 6.2852 202.9365 3.6789 1.1280 0.1696 27.4929 7.5061 77.1042 5.0093 16.1732 0.6589 11.9612 10.8249 2.5021 10.6392 21.8128 3.5012 2.3468 17.5919 20.1338 32.4615 20.4692 43.1565 8.5873 18.4226 9.1252 42.7324 186.1114 34.3657 21.4073 139.3550 53.5759 13.4112 50.7105 14.3461 16.4927 38.5787 34.0254 20.8879 38.1660 26.9568 13.8532 146.4295 136.0232 326.7092 136.3283 7.9916 602.9542 16.7187 25.4917 9.9121 15.8584 0.4776 7.4511 11.8453 21.5878 8.8569 17.2398 25.4719 9.5752 4.4097 19.7553 73.9466 50.8328 17.8570
temp: 298.150 k
press: 1.00000 atm
elementType: 8 8 8 8 7 7 7 6 6 6 6 6 6 6 6 6 6 6 6 1 1 1 1 1 1 1 1 1 1 1 1 1 1 1 1 1
symmnumber: 1
zpe: 750966.6 jmol-1
zpe.correction: 0.286028 hartree
zpe.thermalcorrener: 0.305910 hartree
zpe.thermalcorrenthalpy: 0.306854 hartree
zpe.thermalcorrgfe: 0.237457 hartree
zpe.sumelectzpe: -931.237389 hartree
zpe.sumelectthermal: -931.217507 hartree
zpe.sumelectthermalent: -931.216563 hartree
zpe.sumelectthermalfe: -931.285960 hartree
dipole: 0.1960 -4.2287 -1.8440
dipole: 4.6174
quadrupole: -103.5735 -116.0624 -117.4887
quadrupole: 7.0075 5.0549 -0.1884
quadrupole: 8.8014 -3.6876 -5.1138 7.0075 5.0549 -0.1884
hfenergy: -931.5234167 hartree
pointgroup: C01 [X(C12H17N3O4)]
dipole: 0.1612081 -1.612365 0.821238 debye
polarizability: 145.7257622|15.2261204|191.3983769|6.774019|-0.1444108|144.400602 unknown
InChI: InChI=1S/C12H17N3O4/c1-4-5-12(6-7(2)13-8(3)16)9(17)14-11(19)15-10(12)18/h4,7,13-15H,1,5-6H2,2-3H3
charge 0 multiplicity 1
36 atoms
O  -0.213648 -0.057175 -2.624624
O  -0.434828 0.100312 2.176619
O  -0.51315 3.983302 -0.352778
O  2.072908 1.047225 -0.048044
N  2.203512 -1.141856 0.689536
N  -0.476998 1.934811 -1.477794
N  -0.641016 2.002524 0.878945
C  -0.807557 -0.215187 -0.244203
C  -0.136261 -1.613653 -0.188846
C  1.397836 -1.693218 -0.426469
C  -2.394791 -0.41119 -0.344909
C  -0.431495 0.532949 -1.534026
C  -0.567967 0.607897 1.030167
C  1.818648 -3.159103 -0.659458
C  -2.982756 -1.258344 0.762519
C  -0.537968 2.728236 -0.322269
C  2.513281 0.19435 0.794739
C  -3.740497 -2.362738 0.548729
C  3.376054 0.600626 1.981176
H  -0.383922 -2.068566 0.787171
H  -0.615418 -2.230045 -0.971615
H  1.649696 -1.096809 -1.320895
H  -2.602016 -0.872666 -1.328131
H  -2.868954 0.591623 -0.341086
H  2.908376 -3.233575 -0.822376
H  1.546672 -3.800392 0.20203
H  1.311654 -3.563695 -1.551871
H  2.498286 -1.782899 1.428564
H  -0.295937 2.440128 -2.350811
H  -0.58597 2.566017 1.733211
H  -2.787616 -0.926729 1.791979
H  -4.175184 -2.927259 1.381132
H  -3.955336 -2.730068 -0.462855
H  2.73972 1.094044 2.737931
H  3.89008 -0.251474 2.458386
H  4.126163 1.335196 1.646022
