program: Gaussian 09
title: 000205808
version: EM64L-G09RevD.01
frameworkgroup: C1[X(C13H15NO3)]
method: RPBEPBE
basis: SDD
operation: Freq
keyword: #p
keyword: freq=noraman
keyword: PBEPBE/SDD
title: #p freq=noraman PBEPBE/SDD
converged: YES YES NO NO
title: Mulliken charges:
elementType: O O O N C C C C C C C C C C C C C H H H H H H H H H H H H H H H
charge: -0.279841 -0.245896 -0.228327 -0.030289 0.211435 -0.708895 -0.710563 0.197659 0.383652 -0.298008 -0.380873 -0.262689 -0.416303 -0.346113 0.389124 -0.654421 -0.260104 0.241001 0.247340 0.232539 0.217420 0.236634 0.258567 0.266205 0.260539 0.235300 0.228661 0.257129 0.258415 0.220953 0.237460 0.242289
chargesum: 0.00000
title: Mulliken charges with hydrogens summed into heavy atoms:
elementType: O O O N C C C C C C C C C C C C C
charge: -0.279841 -0.245896 -0.228327 -0.030289 0.211435 0.011985 0.002059 0.197659 0.383652 -0.031803 -0.120334 0.201272 -0.159174 -0.087698 0.389124 0.046281 -0.260104
polarizability: 2.21080281e+02 -2.35420441e+01 1.31906505e+02 6.63663749e-01 1.32977852e+01 1.24987358e+02
1716.lowfreq: -8.9312 -4.4088 0.0005 0.0007 0.0008 2.2143 23.3927 29.8424 65.2134
frequency: 23.3732 29.8324 65.2051 68.6490 79.3309 96.9314 125.2786 146.2442 160.7679 169.5668 200.8609 214.0797 235.8308 258.6249 275.4091 294.5617 318.3435 333.9470 387.2752 413.8831 423.4484 466.2623 487.3562 523.2747 545.5112 559.3262 568.6114 640.2982 684.8762 719.0360 729.9306 746.0933 781.1054 814.1672 825.7701 831.2974 846.4988 881.9859 929.9672 945.1823 961.9604 973.1755 1001.1067 1004.6954 1010.7761 1094.3714 1108.5510 1122.0737 1154.8728 1156.0882 1184.1856 1205.3804 1209.0107 1232.4984 1246.1285 1278.3742 1306.8414 1354.4309 1357.7107 1379.7412 1393.4412 1399.0208 1428.8617 1451.8654 1457.9153 1461.2245 1461.5897 1469.8973 1480.8558 1483.4521 1491.2116 1562.3089 1614.5481 1619.1702 2173.0345 2996.0442 3003.2675 3011.7474 3031.8922 3091.0645 3097.6746 3102.4175 3113.1308 3116.9578 3123.1918 3123.6434 3152.8237 3154.5201 3176.2085 3179.7696
redmass: 4.7978 3.1906 5.4556 3.6754 4.2372 5.4568 5.8820 1.7382 1.6572 1.9838 1.4223 1.5936 2.1931 4.1624 3.4962 2.9831 4.5407 4.1475 3.3096 3.0447 3.5627 5.0263 5.5511 5.6094 6.1319 3.2339 4.0767 6.4965 5.0307 7.2673 4.0229 3.0819 3.9566 1.7987 2.3318 1.3295 1.6009 4.0215 1.8067 1.8887 1.3453 1.3505 2.6461 1.6216 1.9621 2.2619 2.8681 1.3897 2.1681 1.7776 1.3652 2.9485 3.2812 3.7346 3.5595 1.1192 1.2889 1.2784 4.8701 1.2034 1.2274 1.2004 4.1021 1.0522 1.0950 1.0481 1.0490 1.0637 1.0597 1.0684 2.3607 7.0620 7.1136 8.1135 12.6269 1.0363 1.0350 1.0359 1.0600 1.0978 1.1026 1.1004 1.1004 1.0995 1.1061 1.1010 1.0898 1.0888 1.0963 1.0967
irintensity: 1.0714 0.1321 1.7329 0.4242 0.0296 1.1692 5.5821 0.8091 0.5941 3.5135 0.4277 2.4737 0.9129 0.5268 2.2716 3.0447 1.9778 16.4438 0.2772 0.0695 7.8152 0.8543 2.4505 8.0275 1.1428 19.8283 1.6171 3.6076 14.0107 3.0021 1.3654 10.6340 2.3206 7.7513 5.6937 5.9237 83.4123 43.8819 10.9836 24.7128 0.2841 0.0213 3.4536 7.4497 40.8235 81.8131 210.3672 30.7270 201.7384 60.6002 54.7241 5.9963 23.5780 151.7176 22.2800 4.6405 1.4325 0.4671 10.2221 20.7658 17.6371 38.5479 3.0606 10.6984 10.4655 9.5759 7.3010 3.0905 13.9361 21.2269 135.4889 13.7364 168.0461 109.8695 79.7571 12.1793 12.1581 11.7248 31.2865 36.9296 2.4282 8.1353 19.5521 21.3103 29.8323 9.9391 2.8425 3.9446 5.5983 1.4986
temp: 298.150 k
press: 1.00000 atm
elementType: 8 8 8 7 6 6 6 6 6 6 6 6 6 6 6 6 6 1 1 1 1 1 1 1 1 1 1 1 1 1 1 1
symmnumber: 1
zpe: 661611.0 jmol-1
zpe.correction: 0.251994 hartree
zpe.thermalcorrener: 0.269756 hartree
zpe.thermalcorrenthalpy: 0.270700 hartree
zpe.thermalcorrgfe: 0.205153 hartree
zpe.sumelectzpe: -783.531567 hartree
zpe.sumelectthermal: -783.513805 hartree
zpe.sumelectthermalent: -783.512860 hartree
zpe.sumelectthermalfe: -783.578408 hartree
dipole: 5.7951 -0.5518 -1.3939
dipole: 5.9859
quadrupole: -129.3339 -90.8678 -100.2298
quadrupole: 6.3807 1.0210 -2.0795
quadrupole: -22.5234 15.9427 6.5807 6.3807 1.0210 -2.0795
hfenergy: -783.7835609 hartree
pointgroup: C01 [X(C13H15N1O3)]
dipole: 2.2438582 -0.6960489 -0.1637649 debye
polarizability: 205.6792404|-38.6981053|146.2973764|19.0952767|5.1990465|125.9975277 unknown
InChI: InChI=1S/C13H15NO3/c1-4-16-12(15)13(2,3)17-11-7-5-10(9-14)6-8-11/h5-8H,4H2,1-3H3
charge 0 multiplicity 1
32 atoms
O  0.845159 -1.595492 -0.529429
O  2.686349 0.524062 -0.613252
O  2.713466 0.512838 1.718563
N  -5.070861 1.884576 -0.594581
C  1.94422 -1.506524 0.483084
C  1.489705 -2.078024 1.837065
C  3.06112 -2.362481 -0.149364
C  2.465567 -0.049193 0.62574
C  -0.322626 -0.833635 -0.437921
C  -0.601644 0.160617 0.537365
C  -1.277836 -1.118658 -1.450235
C  3.216292 1.929292 -0.630063
C  -1.824839 0.856193 0.48976
C  -2.494514 -0.423802 -1.491934
C  -2.785848 0.576223 -0.518244
C  2.074404 2.942033 -0.52463
C  -4.032373 1.290235 -0.558556
H  2.325756 -2.047869 2.555162
H  0.653384 -1.513011 2.276952
H  1.172879 -3.124978 1.695623
H  3.954642 -2.368298 0.499075
H  2.70177 -3.398502 -0.268199
H  3.332793 -1.960349 -1.137805
H  0.111661 0.406585 1.327343
H  -1.037128 -1.886091 -2.191393
H  3.936261 2.038983 0.199995
H  3.73587 1.988631 -1.599168
H  -2.040235 1.622544 1.241069
H  -3.227129 -0.646807 -2.273704
H  2.477745 3.964249 -0.647392
H  1.320482 2.771045 -1.311615
H  1.582203 2.884205 0.460293
