program: Gaussian 09
title: 000205805
version: EM64L-G09RevD.01
frameworkgroup: C1[X(C17H23NO3)]
method: RPBEPBE
basis: SDD
operation: Freq
keyword: #p
keyword: freq=noraman
keyword: PBEPBE/SDD
title: #p freq=noraman PBEPBE/SDD
converged: YES YES NO NO
title: Mulliken charges:
elementType: O O O N C C C C C C C C C C C C C C C C C H H H H H H H H H H H H H H H H H H H H H H H
charge: -0.271528 -0.251767 -0.273833 -0.061877 -0.140129 -0.148454 -0.483941 -0.487118 -0.489271 -0.469040 0.023822 -0.646061 0.278510 -0.661445 0.488326 -0.551221 -0.391299 0.347465 -0.210540 -0.382273 -0.537280 0.234067 0.232328 0.217056 0.231799 0.232963 0.224932 0.212231 0.232190 0.223755 0.231616 0.247613 0.227621 0.228492 0.195629 0.239722 0.240506 0.257449 0.260656 0.222014 0.241811 0.220363 0.220282 0.243861
chargesum: 0.00000
title: Mulliken charges with hydrogens summed into heavy atoms:
elementType: O O O N C C C C C C C C C C C C C C C C C
charge: -0.271528 -0.251767 -0.273833 -0.061877 0.093938 0.083874 -0.035086 -0.029223 -0.044851 -0.013668 0.271435 0.005680 0.278510 -0.181218 0.488326 -0.293772 -0.130643 0.347465 0.011474 -0.140462 0.147225
polarizability: 2.40606252e+02 -1.76784575e+01 1.84753791e+02 -1.51254321e+01 -1.20713478e+01 1.59832681e+02
1716.lowfreq: -17.1799 -4.3730 0.0004 0.0006 0.0008 5.6505 9.7334 15.7119 28.6172
frequency: -5.6299 15.3354 28.2589 51.4137 70.3872 79.0721 105.5018 162.9138 179.0764 181.3822 196.2025 200.6000 212.0263 223.5091 264.9352 269.2379 284.6329 299.3341 327.8159 362.4722 369.2771 434.4793 438.0979 446.5297 455.6922 493.4198 505.9300 545.8950 565.8738 583.7455 625.2117 686.8962 693.3977 704.6967 741.0611 758.4296 767.5541 776.0068 791.7100 820.0998 837.2299 853.8338 868.3067 877.7610 885.1295 894.8401 921.3328 941.9148 959.3263 961.5372 969.5482 978.6919 982.3264 982.4754 1015.7649 1031.9736 1042.9497 1070.6162 1089.7838 1101.4871 1106.2775 1112.5018 1113.5820 1125.9733 1140.8204 1148.3183 1154.9147 1163.7419 1184.8581 1195.1847 1204.1096 1223.2895 1228.6703 1242.0052 1248.5050 1256.0659 1272.0444 1282.4327 1290.1962 1293.8495 1306.2578 1313.0262 1313.3828 1343.5232 1353.1433 1368.3751 1390.2579 1423.7475 1432.1136 1450.1692 1450.3096 1453.3028 1460.9974 1464.8953 1466.5324 1467.1211 1475.6708 1478.0169 1482.5962 1488.5441 1590.0110 1616.5040 1629.3260 2884.4446 2957.7192 3003.9650 3005.3910 3008.7966 3015.4426 3016.5102 3019.3488 3023.9927 3041.8055 3044.4141 3051.7466 3056.7089 3073.4867 3077.0039 3078.7298 3082.7070 3097.8029 3123.2657 3131.3928 3151.5374 3155.0311 3167.4672
redmass: 5.0168 4.3979 3.9370 5.0274 4.6254 3.5941 5.1964 3.6258 4.4923 1.8760 1.1273 1.9290 3.2465 3.2200 1.8305 3.0202 2.6738 3.0757 2.8739 2.5677 2.5918 4.2074 3.1009 2.9613 2.9598 3.6121 4.0544 4.6760 3.7192 3.8025 4.5855 3.8447 2.6948 5.1035 4.4694 3.1492 2.9972 1.8555 1.8739 2.5374 2.3747 2.7030 1.5803 3.4923 1.4906 1.9521 3.1725 2.7528 3.4633 2.0953 1.3756 1.8159 5.4477 2.4216 3.7046 1.9590 1.6438 2.0250 1.7514 1.6269 1.6892 1.2602 1.3514 2.0935 1.5891 1.2930 2.0268 1.4319 1.1797 1.4758 1.5488 1.4264 1.6246 1.5917 3.9988 1.2739 1.3907 1.5342 1.4684 1.5900 1.3394 1.3857 1.3115 1.4946 1.5103 1.3845 7.7102 1.1703 1.2939 1.1266 1.8545 1.1968 1.0586 1.0908 1.0502 1.0712 1.1012 2.2886 1.0520 1.0903 6.2475 7.4741 8.7004 1.0531 1.0330 1.0590 1.0606 1.0607 1.0619 1.0639 1.0839 1.0760 1.0875 1.1038 1.0891 1.1028 1.1032 1.1038 1.1005 1.1038 1.1003 1.0991 1.0866 1.0921 1.0923 1.0979
irintensity: 0.2901 0.3692 0.8206 0.5403 0.4810 7.4962 4.0882 0.9544 0.4362 0.2069 0.1519 0.2734 0.7125 9.6980 1.5053 2.5536 1.3161 1.7004 1.7584 4.0054 2.1068 11.7310 1.4765 4.3643 1.4329 1.5267 3.5240 9.2578 4.3827 2.2164 11.5743 5.3586 24.1504 9.4378 1.1278 31.8717 11.1609 2.7549 37.5748 1.3327 8.1991 14.2486 0.2529 8.7380 1.9907 14.6661 1.6167 14.0334 107.2567 3.6462 1.8307 2.7855 1.0070 21.9129 96.0622 49.0150 22.3713 23.6279 16.1119 66.0317 151.5226 0.2161 27.0222 28.3954 33.7467 1.6447 0.3308 35.5178 2.3456 2.3933 16.2091 14.2952 181.4216 2.3509 123.9778 3.3061 0.4481 53.5773 6.8075 11.2780 32.0321 27.9947 0.6809 5.4634 3.6128 2.1931 6.0638 3.5305 24.4183 0.5092 34.4715 14.2827 11.4011 12.0027 12.3210 13.8190 21.2519 54.4328 1.3842 22.3065 49.1738 164.1457 81.5056 111.5319 70.0262 16.4870 24.4888 10.8195 10.3952 48.0885 5.4887 53.7139 68.5245 51.2306 11.6891 6.4491 7.4865 40.8688 34.2013 65.3856 6.2758 26.5614 8.0843 5.7174 8.1833 13.9889
temp: 298.150 k
press: 1.00000 atm
elementType: 8 8 8 7 6 6 6 6 6 6 6 6 6 6 6 6 6 6 6 6 6 1 1 1 1 1 1 1 1 1 1 1 1 1 1 1 1 1 1 1 1 1 1 1
symmnumber: 1
zpe: 971719.5 jmol-1
zpe.correction: 0.370108 hartree
zpe.thermalcorrener: 0.389172 hartree
zpe.thermalcorrenthalpy: 0.390116 hartree
zpe.thermalcorrgfe: 0.321493 hartree
zpe.sumelectzpe: -940.418408 hartree
zpe.sumelectthermal: -940.399345 hartree
zpe.sumelectthermalent: -940.398401 hartree
zpe.sumelectthermalfe: -940.467023 hartree
dipole: 0.0523 1.6472 1.3526
dipole: 2.1320
quadrupole: -94.9693 -125.2365 -124.5985
quadrupole: -4.5802 -4.3847 5.3990
quadrupole: 19.9655 -10.3017 -9.6637 -4.5802 -4.3847 5.3990
hfenergy: -940.7885164 hartree
pointgroup: C01 [X(C17H23N1O3)]
dipole: -0.0116918 -0.5790379 0.6067585 debye
polarizability: 241.0824791|-15.0388869|186.9183254|16.7920857|8.9738372|157.1919199 unknown
InChI: InChI=1S/C17H23NO3/c1-18-13-6-7-14(18)11-16(10-13)21-17(19)9-12-4-3-5-15(8-12)20-2/h3-5,8,13-14,16H,6-7,9-11H2,1-2H3
charge 0 multiplicity 1
44 atoms
O  -0.672041 0.216083 -0.953623
O  -0.205198 2.307342 -0.023025
O  5.069297 -1.799431 -0.37202
N  -4.646935 -0.943812 -0.522744
C  -3.73203 -1.516263 0.519217
C  -4.452161 0.528165 -0.306078
C  -4.000984 -0.661125 1.81407
C  -4.486994 0.720705 1.256689
C  -2.278019 -1.35025 0.004307
C  -3.072888 0.906498 -0.90616
C  -1.953127 0.142805 -0.168557
C  -6.055022 -1.385911 -0.391127
C  0.112255 1.353078 -0.772884
C  1.401913 1.258278 -1.583001
C  2.603122 0.928188 -0.69385
C  3.317052 -0.271435 -0.889163
C  3.011456 1.828007 0.328493
C  4.439031 -0.577913 -0.078139
C  4.125927 1.514273 1.130857
C  4.853304 0.315095 0.93913
C  6.234011 -2.167397 0.43457
H  -3.95095 -2.588012 0.666496
H  -5.247814 1.094368 -0.82053
H  -3.095548 -0.568538 2.440066
H  -4.780916 -1.134494 2.436392
H  -5.512317 0.94795 1.598289
H  -3.8418 1.557133 1.57887
H  -1.55856 -1.816395 0.702805
H  -2.192223 -1.858351 -0.972436
H  -3.067993 0.616979 -1.972526
H  -2.897967 1.99493 -0.831058
H  -1.752568 0.625311 0.806157
H  -6.105342 -2.479462 -0.538557
H  -6.657516 -0.911061 -1.185905
H  -6.532195 -1.14842 0.590132
H  1.555574 2.24183 -2.063961
H  1.279625 0.495646 -2.367732
H  3.023961 -0.987802 -1.663611
H  2.447597 2.752044 0.493456
H  4.440744 2.208592 1.918188
H  5.716931 0.095971 1.574059
H  5.967863 -2.270587 1.504894
H  7.05033 -1.426479 0.326518
H  6.562014 -3.140033 0.039233
