program: Gaussian 09
title: 000015411
version: EM64L-G09RevD.01
frameworkgroup: C1[X(C4H8O3S)]
method: RPBEPBE
basis: SDD
operation: Freq
keyword: #pfreq=noraman
keyword: PBEPBE/SDD
title: #p freq=noraman PBEPBE/SDD
converged: NO NO NO NO
title: Mulliken charges:
elementType: S O O O C C C C H H H H H H H H
charge: 1.069513 -0.375751 -0.505955 -0.525543 -0.385041 -0.584658 -0.352971 -0.331688 0.256457 0.240397 0.292743 0.282688 0.216524 0.219296 0.241317 0.242672
chargesum: 0.00000
title: Mulliken charges with hydrogens summed into heavy atoms:
elementType: S O O O C C C C
charge: 1.069513 -0.375751 -0.505955 -0.525543 0.111813 -0.009227 0.082848 0.152301
polarizability: 8.93944385e+01 -2.61025268e+00 7.04371032e+01 2.76436799e+00 -6.00250155e-01 6.79004829e+01
1716.lowfreq: -11.0206 -0.0022 -0.0012 0.0010 16.1184 20.1538 111.7282 166.8799 215.1092
frequency: 111.6861 166.8598 215.0941 222.0296 281.9552 305.2442 346.8475 376.4207 399.5640 476.2709 510.1095 564.8620 799.1822 807.4294 835.3655 863.6182 902.3117 946.9652 966.0642 996.4623 1065.8274 1095.4829 1136.7755 1170.5306 1234.2373 1243.5221 1285.9185 1336.2595 1349.0791 1364.2897 1409.6665 1443.4365 1450.3403 1458.9770 2989.9349 2994.1545 2996.6432 3043.6749 3052.2783 3060.7418 3076.3849 3144.7989
redmass: 4.2696 4.0749 4.0467 4.2387 5.5769 3.1277 3.1861 3.8789 6.0642 7.1339 1.7337 6.4299 3.1699 1.7792 6.8021 2.2519 1.9396 2.1475 5.6782 2.4830 1.5364 1.7999 1.4135 1.2725 1.2646 1.2547 1.1915 1.2797 1.3309 1.3872 1.1053 1.0792 1.0874 1.0834 1.0600 1.0615 1.0628 1.0883 1.0704 1.0981 1.1046 1.1110
irintensity: 2.9036 0.8584 5.1341 1.7842 1.6078 13.2753 24.0920 4.9793 5.2840 46.5669 8.5027 59.1054 4.2813 6.9233 78.9452 27.6772 38.4438 23.0468 75.3470 1.5231 14.9976 1.3927 4.5143 1.2561 4.3674 0.8408 5.0762 13.6480 3.4520 0.4871 8.7958 11.0048 13.2952 23.1864 15.1418 24.3687 26.0203 8.1854 1.3334 25.6673 14.3162 1.2123
temp: 298.150 k
press: 1.00000 atm
elementType: 16 8 8 8 6 6 6 6 1 1 1 1 1 1 1 1
symmnumber: 1
zpe: 319984.9 jmol-1
zpe.correction: 0.121876 hartree
zpe.thermalcorrener: 0.130255 hartree
zpe.thermalcorrenthalpy: 0.131199 hartree
zpe.thermalcorrgfe: 0.089154 hartree
zpe.sumelectzpe: -780.127345 hartree
zpe.sumelectthermal: -780.118966 hartree
zpe.sumelectthermalent: -780.118022 hartree
zpe.sumelectthermalfe: -780.160067 hartree
dipole: 5.8836 2.8407 -0.7118
dipole: 6.5721
quadrupole: -58.9698 -51.4641 -60.8601
quadrupole: -2.5225 -0.1111 -2.5064
quadrupole: -1.8718 5.6339 -3.7621 -2.5225 -0.1111 -2.5064
hfenergy: -780.2492207 hartree
pointgroup: C01 [X(C4H8O3S1)]
dipole: 2.3261411 1.0973742 -0.2656433 debye
dipolederiv: 1.5669806 -0.0872413 -0.0389395 -0.2146162 1.2818478 -0.0401395 -0.140113 0.0329234 1.2246506 -0.8915953 0.1529881 0.0288204 0.154546 -0.5880203 0.0289882 -0.0083274 -0.0215173 -0.4302017 -0.7126146 -0.0302688 -0.0434157 -0.0120401 -0.4878198 0.0308131 -0.1534985 0.0354763 -0.5006779 -0.5440736 -0.041899 -0.005392 -0.0163347 -0.5162374 0.0025653 0.143295 -0.008208 -0.6723368 -0.026479 -0.0428988 -0.0226888 -0.1388298 -0.0673854 -0.0041872 0.0707275 0.0525623 0.048718 0.0362354 0.1239219 -0.0165361 0.1244197 0.0479592 -0.0055398 -0.0022734 0.000644 -0.0388367 -0.0139756 -0.0227313 0.0047844 -0.0539346 -0.0335928 0.0065807 -0.0468044 0.039406 0.1342437 0.5702038 -0.0637756 0.0097978 0.2048807 0.1557479 -0.0281942 0.2331422 -0.1601758 0.2265047 0.0798316 0.0435204 0.0481272 0.0536546 0.0920392 0.0245893 -0.0038443 -0.0356159 -0.0766116 -0.0355718 -0.1323604 0.0167893 -0.0596127 -0.0493671 0.0356347 -0.0063756 0.0239642 0.1132895 0.0055821 0.018773 0.0207858 0.0517521 -0.0380002 -0.0091912 0.0246222 -0.0087838 0.084423 0.0333902 -0.0482237 0.0156938 -0.0518816 0.0472436 -0.0033562 -0.0187214 0.0036821 -0.0344371 0.0945522 -0.0034549 0.0087139 -0.0069227 0.0188984 0.0125839 0.0787697 0.0040954 -0.1373285 -0.1375369 0.0344219 -0.0754062 -0.0030274 0.0724723 0.0040403 -0.1121011 0.0056497 0.053844 -0.03742 0.117132 0.0057248 0.0287613 -0.0383222 -0.0400485 -0.0113812 -0.0387864 0.0993824 0.0124909 -0.0179036 0.0431409 -0.0608147 0.102537 -0.0151389 -0.0471163 0.0746838 -0.0946258 unknown
polarizability: 89.3534043|-2.8800612|70.5229182|2.6191028|-0.5654899|67.8557022 unknown
InChI: InChI=1S/C4H8O3S/c5-8(6)4-2-1-3-7-8/h1-4H2
charge 0 multiplicity 1
16 atoms
S  -1.144813 0.026265 0.070396
O  -0.044383 -1.340231 -0.605276
O  -2.498047 -0.015066 -0.802436
O  -1.158638 -0.052785 1.693394
C  1.385509 1.240012 0.217353
C  0.027016 1.475745 -0.456227
C  2.079498 -0.07522 -0.222875
C  1.256254 -1.331652 0.120533
H  1.249962 1.249684 1.315931
H  2.028726 2.105752 -0.033572
H  -0.49135 2.388373 -0.121334
H  0.039396 1.3901 -1.554046
H  2.266762 -0.054135 -1.313702
H  3.063259 -0.147681 0.279325
H  1.745557 -2.253904 -0.238157
H  1.075291 -1.421556 1.209894
