program: Gaussian 09
title: 000205799
version: EM64L-G09RevD.01
frameworkgroup: C1[X(C10H16N2O2)]
method: RPBEPBE
basis: SDD
operation: Freq
keyword: #p
keyword: freq=noraman
keyword: PBEPBE/SDD
title: #p freq=noraman PBEPBE/SDD
converged: YES YES NO NO
title: Mulliken charges:
elementType: O O N N C C C C C C C C C C H H H H H H H H H H H H H H H H
charge: -0.304839 -0.309555 -0.268734 -0.563197 -0.545499 0.410501 -0.406748 0.024887 -0.423374 0.217657 -0.220907 -0.369300 -0.526755 -0.529512 0.226396 0.227040 0.228325 0.190469 0.241534 0.226725 0.250958 0.270966 0.260218 0.213576 0.228515 0.293025 0.254140 0.251873 0.223104 0.228512
chargesum: 0.00000
title: Mulliken charges with hydrogens summed into heavy atoms:
elementType: O O N N C C C C C C C C C C
charge: -0.304839 -0.309555 0.002232 -0.016033 -0.092063 0.410501 0.012046 0.024887 -0.181840 0.217657 0.005819 -0.118341 0.175553 0.173977
polarizability: 1.63394985e+02 -3.18455172e-01 1.43765320e+02 -5.65441725e+00 -2.25218923e+00 8.71402374e+01
1716.lowfreq: -5.9979 -0.0001 0.0004 0.0004 1.0986 7.5164 27.7877 55.2154 79.3610
frequency: 26.6985 55.2034 79.3361 91.0820 110.7011 112.4084 120.5333 157.7999 171.0285 182.0741 217.7576 244.3977 268.3435 295.2616 349.6479 372.8754 398.2961 433.3384 454.6792 523.7258 550.2985 566.5093 602.5595 623.3832 667.8206 735.6049 753.8597 780.7666 797.4227 808.0029 895.9682 902.6860 950.4692 968.7227 982.2631 1027.0875 1032.1136 1068.6554 1093.9758 1113.1106 1114.7552 1131.7950 1147.2316 1153.9460 1164.9508 1172.1530 1179.1846 1232.5619 1243.9959 1263.3149 1283.2714 1288.6277 1352.2165 1365.6350 1415.7678 1428.5539 1444.9244 1455.7625 1457.2052 1460.0150 1461.1716 1468.0367 1478.1186 1484.1878 1490.0822 1588.5830 1595.0341 1662.2753 2859.8195 2967.1752 2970.9526 3000.5099 3011.8264 3064.8551 3066.0077 3067.3432 3118.4369 3119.1442 3124.8916 3146.1589 3167.6114 3346.4256 3431.4450 3539.5085
redmass: 3.8863 4.4650 2.0028 2.7664 3.0528 3.2263 2.7042 1.1101 1.1240 2.4917 3.7646 5.1300 4.3338 3.0652 4.7469 2.8808 1.5378 2.8989 3.7246 4.7960 5.2471 3.6151 3.2772 2.3671 3.5716 1.3178 2.0532 2.7313 1.5843 1.9435 5.2359 1.4166 8.9622 1.3298 3.5521 2.3878 3.0331 2.3177 2.1156 1.2376 1.2413 2.9354 1.5274 1.3571 1.8194 1.6261 1.2901 1.9222 1.5252 1.6792 1.3624 1.3839 1.3960 6.6328 1.3582 1.2870 1.9028 1.1063 1.1326 1.0753 2.0448 1.1669 1.0704 1.0726 1.0583 7.0763 6.8060 1.0660 1.0700 1.0320 1.0310 1.0611 1.0856 1.1031 1.1029 1.1032 1.1033 1.1026 1.0875 1.0915 1.0985 1.0494 1.0757 1.0917
irintensity: 0.3853 0.5366 6.6488 7.4177 0.1152 1.3387 6.7733 0.3455 0.6569 9.9101 5.1405 4.0770 2.9609 14.4570 0.3228 6.8096 12.6961 25.4183 2.0311 7.1914 1.1212 7.4120 59.8767 172.1670 50.0762 83.8803 25.2914 19.3927 6.0826 30.7222 14.4462 0.6147 48.1277 1.9359 61.8301 28.7577 5.1956 26.6729 21.9582 8.2867 4.5440 16.1826 7.9594 0.9638 21.5369 14.9241 5.7550 47.1157 32.6622 19.5999 13.9473 1.8412 6.6884 6.3324 11.4480 8.8355 86.3848 23.7341 1.1823 1.5646 12.2259 17.4822 7.8623 9.3782 12.5985 17.9440 3.2701 21.3106 103.1314 81.0716 58.4262 22.3715 28.3561 30.3730 27.8438 19.2815 18.6075 25.7450 6.8275 15.6207 15.1092 23.5111 2.5611 1.0413
temp: 298.150 k
press: 1.00000 atm
elementType: 8 8 7 7 6 6 6 6 6 6 6 6 6 6 1 1 1 1 1 1 1 1 1 1 1 1 1 1 1 1
symmnumber: 1
zpe: 655385.7 jmol-1
zpe.correction: 0.249623 hartree
zpe.thermalcorrener: 0.265218 hartree
zpe.thermalcorrenthalpy: 0.266163 hartree
zpe.thermalcorrgfe: 0.206132 hartree
zpe.sumelectzpe: -649.442498 hartree
zpe.sumelectthermal: -649.426903 hartree
zpe.sumelectthermalent: -649.425958 hartree
zpe.sumelectthermalfe: -649.485989 hartree
dipole: 1.2417 -0.6730 -0.9229
dipole: 1.6871
quadrupole: -90.4822 -75.3022 -84.3940
quadrupole: -3.0717 9.7191 -0.1668
quadrupole: -7.0894 8.0906 -1.0012 -3.0717 9.7191 -0.1668
hfenergy: -649.6921209 hartree
pointgroup: C01 [X(C10H16N2O2)]
dipole: -0.4932094 -0.2394096 0.3741994 debye
polarizability: 163.2210817|-0.5138132|143.8385887|-6.6144234|1.4902404|87.2408715 unknown
InChI: InChI=1S/C10H16N2O2/c1-13-9-5-3-4-8(6-7-12-11)10(9)14-2/h3-5,12H,6-7,11H2,1-2H3
charge 0 multiplicity 1
30 atoms
O  -0.448436 -1.545097 -0.451317
O  -3.032296 -0.685989 0.556512
N  3.94507 -0.431372 -0.442062
N  4.929311 -0.889485 0.494355
C  1.648683 0.3340 -0.997146
C  0.296935 0.774605 -0.462371
C  2.636995 -0.041448 0.136092
C  -0.717944 -0.179258 -0.179487
C  0.024341 2.142857 -0.207825
C  -1.992287 0.24258 0.298186
C  -1.217434 2.556618 0.323205
C  -2.231629 1.605513 0.570427
C  -0.529667 -2.445269 0.722669
C  -3.558446 -1.363113 -0.651699
H  2.105964 1.146015 -1.591365
H  1.520242 -0.543092 -1.65858
H  2.794891 0.830448 0.799506
H  2.188777 -0.854426 0.762707
H  0.801662 2.884809 -0.425833
H  -1.40314 3.616749 0.525912
H  -3.21381 1.8948 0.957612
H  3.843198 -1.127051 -1.193623
H  -1.532238 -2.402967 1.183504
H  0.237084 -2.164797 1.470436
H  -0.322142 -3.453407 0.332077
H  5.515966 -0.118971 0.827623
H  4.560811 -1.473117 1.263542
H  -2.753978 -1.899415 -1.186989
H  -4.029449 -0.623259 -1.326461
H  -4.317138 -2.071363 -0.284906
