program: Gaussian 09
title: 000205795
version: EM64L-G09RevD.01
frameworkgroup: C1[X(C14H22N2O3)]
method: RPBEPBE
basis: SDD
operation: Freq
keyword: #p
keyword: freq=noraman
keyword: PBEPBE/SDD
title: #p freq=noraman PBEPBE/SDD
converged: YES YES NO NO
title: Mulliken charges:
elementType: O O O N N C C C C C C C C C C C C C C H H H H H H H H H H H H H H H H H H H H H H
charge: -0.255789 -0.286887 -0.265165 -0.109726 -0.037798 -0.389047 -0.327428 -0.323909 -0.275257 -0.670082 -0.670783 0.166437 -0.319763 0.225503 -0.242566 -0.442224 0.198097 -0.258088 -0.665594 0.211826 0.219376 0.191529 0.207632 0.205740 0.188685 0.241585 0.226270 0.207479 0.229075 0.207703 0.207453 0.228552 0.209464 0.258084 0.278737 0.278110 0.222539 0.234933 0.217224 0.227323 0.250751
chargesum: 0.00000
title: Mulliken charges with hydrogens summed into heavy atoms:
elementType: O O O N N C C C C C C C C C C C C C C
charge: -0.255789 -0.286887 -0.265165 -0.109726 -0.037798 0.042156 0.071733 0.070516 0.192597 -0.025826 -0.025314 0.166437 -0.061679 0.225503 0.036171 -0.164114 0.198097 0.199385 0.029703
polarizability: 2.77745223e+02 8.23895319e+00 1.68156607e+02 -1.41995497e+00 4.50667762e+00 1.24622415e+02
1716.lowfreq: -9.8339 -0.0002 0.0002 0.0004 2.4233 6.1582 13.9755 24.7412 34.6363
frequency: 13.8705 24.4573 34.5801 48.1714 50.6499 64.9493 80.6163 82.0540 84.0199 109.6236 135.7006 162.0466 171.9143 177.8939 213.1577 221.8358 261.0325 278.3648 285.8959 295.8208 315.8944 344.1356 380.1702 413.3097 418.8681 442.1196 468.9879 482.7492 514.3456 518.7882 624.9362 647.4683 694.8909 733.7017 751.9420 770.2662 788.8857 795.1615 798.2127 815.8228 825.6445 841.9756 852.8739 914.3930 938.0856 953.7201 980.4749 991.5383 996.6077 1007.4239 1061.2925 1062.4427 1066.7440 1076.4354 1085.2382 1092.7718 1095.6193 1122.6085 1125.0502 1156.0776 1160.7815 1208.0397 1229.2812 1252.2338 1258.5235 1274.7213 1279.1046 1286.2502 1290.2518 1292.5068 1319.8532 1341.1477 1358.0227 1362.4457 1363.2948 1369.5987 1387.3686 1388.5809 1389.1459 1390.3121 1454.3606 1459.7846 1462.1837 1463.3504 1464.8585 1469.9770 1471.2196 1480.1979 1484.5595 1485.1278 1487.2690 1492.6152 1541.6508 1594.9719 1616.1633 2854.4030 2863.1046 2907.7539 2981.4676 2984.3381 2992.5265 3020.8923 3023.3852 3029.7088 3034.7674 3052.0971 3073.3085 3076.6746 3087.8831 3091.6903 3092.4987 3093.2695 3095.7564 3119.0724 3160.5138 3167.1935 3185.9309
redmass: 3.4186 4.0016 3.9631 2.9913 3.8855 3.7282 3.2854 2.2381 3.0569 3.2987 2.7777 3.5400 2.4901 1.5679 1.2620 1.3589 2.0378 4.6429 2.5829 2.6058 3.0788 3.9045 3.1938 3.7766 3.8784 2.9707 4.6507 2.8544 3.3127 3.7512 7.9420 6.7133 6.0855 3.1944 2.7619 5.5032 1.1599 1.2291 1.2381 1.4209 3.3451 4.1653 1.5011 1.9505 7.2858 1.4454 3.8200 2.2377 1.3325 2.5735 1.9022 2.3240 4.2469 1.8743 2.2337 2.7165 2.1663 1.6421 1.3530 1.6783 1.3672 2.2448 1.7106 3.2492 2.3538 1.1162 1.1227 1.3137 1.5651 1.2978 1.3930 6.3288 1.3349 1.9149 1.3895 1.5740 1.2325 1.3778 1.2519 1.4201 1.2772 1.0906 1.0584 1.1469 1.3231 1.2152 1.1192 1.0550 1.0553 1.0747 1.0694 1.0769 6.9672 6.3452 9.8448 1.0721 1.0714 1.0703 1.0359 1.0358 1.0361 1.0624 1.0833 1.0594 1.0875 1.0900 1.0984 1.0982 1.0974 1.1003 1.1004 1.1033 1.1080 1.1060 1.0900 1.0925 1.0976
irintensity: 0.3792 0.0892 0.1785 0.0128 1.1909 0.9153 0.3519 0.3059 0.1894 0.1198 1.2909 6.7314 3.2748 1.5411 1.0912 1.6486 4.5035 0.9846 2.9954 0.7628 23.0945 1.3111 13.0125 0.8182 5.7742 3.2151 1.9920 5.6705 3.3287 10.1601 0.1854 27.9399 16.1073 16.7214 2.5318 15.3150 5.6125 3.5077 5.9491 2.3009 5.8076 5.1015 36.3393 1.8686 189.1103 7.2297 1.5252 7.5730 0.4939 29.3486 42.6342 65.6570 338.1148 14.6970 3.2812 9.1628 21.3148 14.5412 37.2605 33.3908 9.2936 44.2543 18.6288 401.4784 398.4709 1.5695 3.1725 5.4224 18.3873 17.7260 7.3248 25.9056 7.7886 88.5599 9.1710 67.8793 19.1808 27.5655 11.3511 22.2843 94.6577 7.0517 11.5993 37.2731 24.4489 10.6251 2.2725 4.4025 10.7492 13.7005 11.3832 12.0903 11.9065 242.0612 304.9332 33.5229 180.1328 84.9839 30.8090 30.7788 22.2677 26.9399 11.4464 36.1813 16.8325 15.2315 52.3746 69.6715 40.8563 30.0247 55.0867 0.7318 31.5071 30.4102 0.1986 4.9762 3.8108
temp: 298.150 k
press: 1.00000 atm
elementType: 8 8 8 7 7 6 6 6 6 6 6 6 6 6 6 6 6 6 6 1 1 1 1 1 1 1 1 1 1 1 1 1 1 1 1 1 1 1 1 1 1
symmnumber: 1
zpe: 899486.0 jmol-1
zpe.correction: 0.342596 hartree
zpe.thermalcorrener: 0.363852 hartree
zpe.thermalcorrenthalpy: 0.364796 hartree
zpe.thermalcorrgfe: 0.288857 hartree
zpe.sumelectzpe: -880.367885 hartree
zpe.sumelectthermal: -880.346629 hartree
zpe.sumelectthermalent: -880.345685 hartree
zpe.sumelectthermalfe: -880.421625 hartree
dipole: -1.5275 0.9003 0.0521
dipole: 1.7738
quadrupole: -99.1312 -112.1445 -114.2129
quadrupole: 12.3213 4.6216 -0.9993
quadrupole: 9.3650 -3.6483 -5.7167 12.3213 4.6216 -0.9993
hfenergy: -880.7104814 hartree
pointgroup: C01 [X(C14H22N2O3)]
dipole: -0.6070646 -0.3438818 -0.0161442 debye
polarizability: 277.4227933|-9.8543339|168.1208713|-2.6137289|6.0891399|124.980581 unknown
InChI: InChI=1S/C14H22N2O3/c1-4-16(5-2)9-10-19-13-8-7-12(11-15-13)14(17)18-6-3/h7-8,11H,4-6,9-10H2,1-3H3
charge 0 multiplicity 1
41 atoms
O  -1.320546 1.163202 0.387079
O  4.423931 -1.391026 -0.041384
O  5.094541 0.800333 0.423254
N  -4.725183 -0.36537 0.158177
N  0.392862 -0.436129 0.075026
C  -3.690105 0.689232 0.292546
C  -5.004387 -1.06246 1.443535
C  -5.952733 0.088203 -0.546555
C  -2.298688 0.066352 0.125166
C  -5.518739 -2.501604 1.249965
C  -5.747381 0.252257 -2.064432
C  0.020693 0.845025 0.34193
C  0.94306 1.903162 0.584277
C  2.726374 0.263744 0.269184
C  2.308173 1.598757 0.545767
C  1.72651 -0.712603 0.04148
C  4.178799 -0.040783 0.230581
C  5.85894 -1.799565 -0.128869
C  6.404204 -1.565155 -1.540494
H  -3.744762 1.220231 1.271835
H  -3.833839 1.4531 -0.491416
H  -5.727217 -0.481612 2.071059
H  -4.059368 -1.102246 2.017134
H  -6.734062 -0.67538 -0.379894
H  -6.346074 1.042724 -0.112566
H  -2.149104 -0.324597 -0.895471
H  -2.116094 -0.756252 0.838918
H  -5.677199 -2.989897 2.229737
H  -4.785299 -3.091241 0.673103
H  -6.479916 -2.528131 0.705138
H  -6.690377 0.566579 -2.549755
H  -5.420656 -0.703824 -2.508945
H  -4.98248 1.015383 -2.297943
H  0.571109 2.909121 0.791403
H  3.070088 2.364169 0.723278
H  2.005574 -1.747562 -0.174852
H  5.839478 -2.86885 0.136094
H  6.432647 -1.229046 0.622425
H  7.438619 -1.950354 -1.609457
H  5.789766 -2.089238 -2.292781
H  6.421541 -0.488549 -1.778774
