program: Gaussian 09
title: 000205794
version: EM64L-G09RevD.01
frameworkgroup: C1[X(C17H17N3)]
method: RPBEPBE
basis: SDD
operation: Freq
keyword: #pfreq=noraman
keyword: PBEPBE/SDD
title: #p freq=noraman PBEPBE/SDD
converged: YES YES NO NO
title: Mulliken charges:
elementType: N N N C C C C C C C C C C C C C C C C C H H H H H H H H H H H H H H H H H
charge: -0.408744 -0.688761 -0.018757 -0.581122 0.487358 -0.369854 0.374026 -0.645934 0.374108 -0.396879 -0.421217 0.352556 -0.422687 -0.403795 -0.242217 0.219194 -0.241587 -0.285227 -0.441574 -0.368047 0.215438 0.221797 0.228299 0.212492 0.248038 0.233781 0.314852 0.237474 0.238322 0.239458 0.229486 0.229936 0.229701 0.221893 0.229542 0.297668 0.300982
chargesum: 0.00000
title: Mulliken charges with hydrogens summed into heavy atoms:
elementType: N N N C C C C C C C C C C C C C C C C C
charge: -0.093892 -0.090111 -0.018757 -0.143887 0.487358 0.070936 0.374026 -0.397896 0.374108 -0.163099 -0.183743 0.352556 -0.184364 -0.164338 -0.012731 0.219194 -0.011650 -0.055525 -0.219681 -0.138504
polarizability: 2.69630206e+02 4.96964104e+01 2.04697112e+02 3.17700877e+00 1.39933657e+01 1.54175596e+02
1716.lowfreq: -3.6683 -0.0007 -0.0005 0.0004 4.7064 12.2181 20.3647 23.4250 24.9710
frequency: 20.1897 22.5650 24.1886 79.9908 96.6057 122.9339 180.0074 187.2444 192.5349 256.2818 270.3278 284.6465 302.1308 327.8045 373.7742 396.3169 403.3560 437.4828 467.6438 480.1309 484.0510 513.5071 520.7480 534.2564 564.4649 583.4036 614.1660 619.0348 640.8940 657.4699 697.3110 745.3415 756.7702 760.7354 786.3756 790.4611 808.6338 826.0670 835.0663 866.1504 870.3858 876.3420 904.0465 923.2379 928.6277 941.2837 961.3505 978.4774 990.3919 993.6390 1023.7528 1037.8540 1041.9215 1051.0061 1114.6083 1125.8165 1158.3471 1172.8971 1182.9974 1184.8048 1198.2886 1221.4272 1238.1804 1253.7054 1263.8729 1275.8595 1309.1531 1323.7438 1326.9557 1356.8436 1358.4330 1363.8582 1411.0018 1419.1261 1425.4758 1434.8200 1453.1026 1461.8976 1467.6509 1487.5761 1504.7668 1515.2980 1574.1536 1582.3360 1585.3809 1606.7038 1637.3061 1642.0508 2908.5890 2991.4632 3021.4189 3055.0769 3098.8747 3110.7492 3116.4258 3120.1457 3125.6200 3127.5601 3141.0693 3143.4064 3161.4525 3162.8954 3463.2442 3503.4471 3642.9818
redmass: 5.1825 4.6506 4.9758 4.5925 4.8193 4.7453 3.6436 3.6184 2.3999 5.0006 2.6225 3.9243 2.5839 1.3293 3.6961 3.5837 2.9098 2.5494 3.6072 2.9878 2.7013 6.5023 2.2600 2.1853 3.5658 3.1496 4.7162 5.9900 1.6857 2.7944 3.6531 4.0009 1.3584 3.8217 2.6181 3.1930 1.3452 2.1310 1.7580 3.6491 1.6238 1.4543 2.1861 1.4205 1.8019 4.1074 1.3771 1.3941 1.8976 1.3523 2.2623 2.0253 1.8345 1.9372 3.2333 1.7774 1.3090 1.1149 1.6071 1.4782 1.2367 1.3923 2.0769 1.8181 1.7470 1.7868 2.2401 1.4864 1.6159 2.9368 1.5290 1.4836 5.1770 2.5186 3.7133 2.9096 1.5549 1.1228 2.5771 1.1186 3.4278 3.5453 5.0819 7.1821 4.9148 5.6348 1.2188 6.3338 1.0698 1.0621 1.0897 1.1012 1.0903 1.0912 1.0865 1.0861 1.0888 1.0887 1.0974 1.0948 1.0953 1.1004 1.0752 1.0462 1.0998
irintensity: 0.4102 0.6228 1.3624 0.3250 2.5629 1.9535 0.5673 1.3654 3.4827 0.4057 9.5437 3.4614 5.7525 20.0844 0.9038 0.9234 1.3471 28.0436 8.0946 43.8062 13.6449 0.1308 105.4332 88.5202 1.7122 38.8233 19.2306 1.5586 141.6928 2.1895 1.9237 7.7651 36.7882 7.2652 4.6549 4.5530 59.6118 23.7052 45.3777 4.0700 28.0180 8.0459 5.3144 0.8514 2.6934 4.7762 3.0976 4.6811 4.4042 0.0746 6.6407 0.3821 8.8224 21.3391 14.4236 7.1611 3.6180 0.3717 30.9706 3.5511 1.4469 5.9822 4.0114 29.9551 2.5838 6.1573 56.2763 12.7527 14.9595 7.9289 1.5282 4.6668 1.5581 6.5111 0.4830 2.4556 92.3575 13.6188 0.5722 64.0886 119.5999 11.4076 38.1272 1.2240 233.9721 8.3195 78.2219 10.4927 59.8342 23.6632 51.2734 21.1161 40.1349 12.7774 6.6875 7.1533 0.1578 21.5458 15.1585 38.4653 20.5318 34.0995 47.0768 14.2761 19.1625
temp: 298.150 k
press: 1.00000 atm
elementType: 7 7 7 6 6 6 6 6 6 6 6 6 6 6 6 6 6 6 6 6 1 1 1 1 1 1 1 1 1 1 1 1 1 1 1 1 1
symmnumber: 1
zpe: 793041.8 jmol-1
zpe.correction: 0.302054 hartree
zpe.thermalcorrener: 0.318977 hartree
zpe.thermalcorrenthalpy: 0.319922 hartree
zpe.thermalcorrgfe: 0.255358 hartree
zpe.sumelectzpe: -820.868985 hartree
zpe.sumelectthermal: -820.852061 hartree
zpe.sumelectthermalent: -820.851117 hartree
zpe.sumelectthermalfe: -820.915681 hartree
dipole: -5.2031 0.9505 -1.8249
dipole: 5.5951
quadrupole: -147.1190 -103.5557 -113.2357
quadrupole: 14.1128 -9.2898 7.5462
quadrupole: -25.8155 17.7477 8.0677 14.1128 -9.2898 7.5462
hfenergy: -821.1710384 hartree
pointgroup: C01 [X(C17H17N3)]
dipole: -2.0524935 -0.2446659 0.7570583 debye
polarizability: 263.7853915|-52.8311496|210.9917063|-3.1946881|13.9323278|153.7258162 unknown
InChI: InChI=1S/C17H17N3/c18-16-12-19-9-8-17(16)20-10-7-13-5-6-14-3-1-2-4-15(14)11-13/h1-6,8-9,11-12,20H,7,10,18H2
charge 0 multiplicity 1
37 atoms
N  1.720773 -0.650611 0.554903
N  2.241921 2.087609 0.517927
N  5.482148 0.795117 -0.858056
C  -0.018371 -2.268048 1.27425
C  -1.155313 -1.506612 0.604661
C  1.350123 -2.069526 0.573847
C  -2.855093 0.295041 0.614591
C  -1.792499 -0.436066 1.244435
C  -3.275474 -0.085874 -0.7182
C  -1.585384 -1.875179 -0.718081
C  -2.613658 -1.186308 -1.358896
C  2.972883 -0.217934 0.099632
C  -3.517443 1.389331 1.263607
C  -4.337411 0.640676 -1.350309
C  -4.549946 2.07991 0.62382
C  3.242789 1.194188 0.082063
C  -4.963481 1.70343 -0.69424
C  4.006409 -1.087514 -0.333488
C  4.493244 1.629739 -0.414556
C  5.228216 -0.543039 -0.7919
H  -0.239071 -3.353144 1.275457
H  0.076854 -1.950691 2.328968
H  2.121763 -2.635171 1.129709
H  1.312564 -2.49709 -0.455011
H  -1.488414 -0.150835 2.260358
H  -1.095136 -2.716888 -1.222585
H  0.942385 -0.000791 0.392793
H  -2.931941 -1.481664 -2.365931
H  -3.203595 1.67665 2.274548
H  -4.652011 0.349662 -2.359718
H  -5.050073 2.913811 1.128551
H  -5.774025 2.253952 -1.18414
H  3.861951 -2.171845 -0.344828
H  4.716635 2.704895 -0.452903
H  6.034922 -1.203596 -1.129692
H  1.676278 1.820747 1.325177
H  2.41998 3.085567 0.415035
