program: Gaussian 09
title: 000205791
version: EM64L-G09RevD.01
frameworkgroup: C1[X(C20H25N9O2)]
method: RPBEPBE
basis: SDD
operation: Freq
keyword: #p
keyword: freq=noraman
keyword: PBEPBE/SDD
title: #p freq=noraman PBEPBE/SDD
converged: YES YES NO NO
title: Mulliken charges:
elementType: O O N N N N N N N N N C C C C C C C C C C C C C C C C C C C C H H H H H H H H H H H H H H H H H H H H H H H H H
charge: -0.333046 -0.278903 -0.346882 -0.386143 -0.407251 -0.157217 -0.009714 -0.674294 -0.682395 -0.381862 -0.449583 -0.406339 -0.381347 -0.446817 0.340546 -0.448116 0.185225 0.325221 -0.505092 0.470229 0.142316 -0.427163 -0.426426 -0.417443 0.139163 -0.189870 -0.378722 0.136569 0.176435 -0.352793 -0.198849 0.247410 0.264848 0.262492 0.238233 0.227525 0.231052 0.239677 0.222905 0.317424 0.322943 0.287468 0.245338 0.247843 0.234807 0.279200 0.233074 0.252372 0.235060 0.309125 0.289919 0.414793 0.378589 0.313012 0.198549 0.276907
chargesum: 0.00000
title: Mulliken charges with hydrogens summed into heavy atoms:
elementType: O O N N N N N N N N N C C C C C C C C C C C C C C C C C C C C
charge: -0.333046 -0.278903 -0.029458 -0.063200 -0.098126 -0.157217 -0.009714 0.030418 0.009206 -0.183314 -0.172676 0.105919 0.119379 0.011760 0.340546 0.014466 0.185225 0.325221 -0.217624 0.470229 0.142316 -0.181825 -0.178583 -0.182636 0.139163 0.043204 -0.099522 0.136569 0.176435 -0.100421 0.036211
polarizability: 4.73943013e+02 -4.23164411e+01 3.85774565e+02 4.88148839e+00 -4.17411379e+00 1.50169826e+02
1716.lowfreq: -2.8697 -1.8427 0.0007 0.0008 0.0009 4.0393 17.0272 25.2411 32.3494
frequency: 16.9346 25.0693 32.3142 43.4647 49.1171 55.3774 59.0491 74.1118 77.2344 90.5738 97.6519 100.2031 122.0565 131.0329 138.9575 150.9093 161.9193 171.5736 192.7091 198.3571 200.8160 241.4373 244.5256 257.9904 290.6813 299.2887 312.3786 319.3434 326.0897 372.2671 397.6366 406.5817 413.9642 417.4084 426.2196 441.1268 453.2644 474.0320 496.0327 498.7889 512.2402 524.0483 547.5143 559.7034 584.1165 590.2323 593.7529 630.4092 635.1759 642.7035 659.3006 675.8539 681.3800 686.8009 695.1845 697.4136 729.7268 734.5166 737.8164 751.9422 769.0316 801.6688 804.5737 823.4869 828.1408 833.7342 858.7697 885.8060 889.7579 896.7515 914.0179 918.9326 931.3976 946.8633 955.6926 960.4369 976.5417 980.6168 985.0278 987.3959 1001.6109 1016.3478 1027.5033 1038.8999 1052.9631 1059.3097 1081.3836 1086.9362 1101.9218 1105.5448 1122.3739 1128.1366 1132.0713 1160.1655 1169.1447 1183.0255 1184.7784 1193.6154 1202.8748 1226.5943 1241.2736 1247.4483 1275.7208 1281.3628 1285.4949 1287.4286 1300.6482 1304.6910 1313.5578 1352.9257 1355.6618 1364.1284 1390.0799 1397.2106 1405.3551 1417.7507 1440.8146 1445.8390 1449.5512 1455.5446 1459.7982 1465.3515 1472.2440 1482.0964 1494.3349 1508.4943 1512.7074 1565.8810 1577.8160 1595.0806 1597.8907 1601.0597 1611.3433 1616.6203 1619.2356 1647.8630 1692.9280 3010.0277 3017.2351 3023.9888 3034.5380 3069.1020 3083.5932 3087.3057 3094.4417 3108.0694 3128.6419 3138.0511 3142.4484 3145.3296 3160.9169 3163.4511 3173.3459 3194.9981 3261.5318 3303.1405 3402.5493 3425.9111 3547.4314 3568.3952 3583.5332 3637.6747
redmass: 5.6131 6.1004 6.3379 5.4373 4.8626 5.1027 6.1280 4.9486 6.7611 4.6659 4.8115 4.1753 4.9432 4.9559 5.4120 4.7647 4.5318 5.0384 4.3420 5.2007 4.1283 4.1682 4.4755 6.3037 3.6958 3.0549 5.6822 4.8344 4.0447 5.4039 3.0501 3.5800 2.2433 1.9119 2.8476 2.6715 2.6470 3.8658 3.9953 6.8574 1.5588 1.7492 2.6958 5.5210 1.2664 3.9478 1.2736 6.2263 5.8775 4.6529 4.6430 2.9343 1.4407 4.5617 2.1794 2.0637 3.4122 4.4171 1.1018 2.1568 2.2853 1.6815 1.4844 2.0694 1.5275 3.4911 2.8399 1.3039 2.4073 1.5877 2.1242 2.3374 1.5335 1.4200 1.2120 3.3028 1.3926 2.6883 5.3677 5.7464 1.3598 3.8361 2.1802 2.5129 1.8681 2.3238 1.8670 1.7364 1.5346 1.6686 1.5287 1.9015 2.3133 3.5807 1.1698 1.1052 1.3396 1.2877 2.4978 1.5576 1.9369 1.4372 1.3763 2.1341 1.5635 1.1962 1.4439 1.5742 1.2558 1.2903 1.3143 5.2845 8.3493 9.2331 2.8549 3.3128 1.7120 2.3800 1.1522 1.5958 1.4075 2.0524 1.3831 1.2881 2.0925 1.9122 2.3446 5.6280 6.5997 6.2228 2.2376 4.7958 6.0726 5.7513 6.6347 1.8160 1.1160 1.0640 1.0599 1.0593 1.0587 1.0796 1.1031 1.0998 1.1037 1.1070 1.0873 1.0913 1.0870 1.0901 1.0922 1.0989 1.0991 1.0913 1.0726 1.0753 1.0751 1.0535 1.0778 1.0770 1.0819 1.0972
irintensity: 0.7783 6.2530 0.7629 1.5825 0.9936 5.4953 0.1424 7.2658 1.2535 1.0827 2.9883 6.5436 3.6610 1.4363 6.3439 3.3688 7.5882 9.0473 9.5595 8.2341 1.8869 6.2641 1.8867 0.7332 9.6368 4.6941 11.1763 0.5045 9.5747 12.4596 31.6658 23.0736 91.8452 89.1007 27.3831 37.2999 9.3637 13.9473 1.1864 3.1327 61.9680 34.0356 22.0883 2.0824 21.9586 8.0721 79.8749 35.0319 19.0270 2.8442 8.4076 8.8348 30.4365 17.5244 9.4717 75.8215 61.9762 12.3785 89.7851 5.7195 9.9684 61.8411 107.8304 12.7359 40.8889 6.4318 6.2214 37.4452 10.4539 1.5226 4.0945 2.1404 14.0623 0.5544 159.8725 10.3277 1.4454 1.7892 3.2388 2.3866 1.8676 5.1433 16.9514 6.6155 27.1000 4.6361 46.6724 6.2675 132.9166 1.4992 2.1045 4.7103 6.7143 174.9045 5.6491 0.1364 9.1751 2.1075 21.9007 56.4571 104.1000 18.2451 15.3775 162.3078 59.7784 53.5870 114.1985 14.7385 21.2037 3.5380 3.8409 84.9202 5.8456 76.5352 88.0533 16.7752 41.4674 47.4813 27.9212 29.4125 14.5021 31.6803 127.7431 43.3979 318.6815 343.1575 62.1892 338.7318 139.1562 1.2854 120.8581 17.9284 59.9998 223.5012 70.9389 238.6050 60.4333 21.3035 29.7806 3.9347 27.3833 1363.7883 3.5350 9.5494 6.6764 13.7235 4.0999 12.5186 12.1675 3.2095 1.8220 23.2102 18.6565 0.9866 45.5066 43.6628 9.4066 160.5543 27.7550 12.2598 20.3443 46.6332
temp: 298.150 k
press: 1.00000 atm
elementType: 8 8 7 7 7 7 7 7 7 7 7 6 6 6 6 6 6 6 6 6 6 6 6 6 6 6 6 6 6 6 6 1 1 1 1 1 1 1 1 1 1 1 1 1 1 1 1 1 1 1 1 1 1 1 1 1
symmnumber: 1
zpe: 1174799.0 jmol-1
zpe.correction: 0.447457 hartree
zpe.thermalcorrener: 0.476936 hartree
zpe.thermalcorrenthalpy: 0.477881 hartree
zpe.thermalcorrgfe: 0.385431 hartree
zpe.sumelectzpe: -1418.087144 hartree
zpe.sumelectthermal: -1418.057665 hartree
zpe.sumelectthermalent: -1418.056721 hartree
zpe.sumelectthermalfe: -1418.149170 hartree
dipole: 1.0198 6.9214 0.3485
dipole: 7.0048
quadrupole: -201.2722 -157.6630 -190.3513
quadrupole: 3.5493 -8.9912 -5.4402
quadrupole: -18.1767 25.4325 -7.2558 3.5493 -8.9912 -5.4402
hfenergy: -1418.5346012 hartree
pointgroup: C01[X(C20H25N9O2)]
dipole: 0.2241696 -2.7451263 0.0947133 debye
polarizability: 484.2144644|-18.4425357|371.7142761|-35.7482716|6.4917248|153.9586634 unknown
InChI: InChI=1S/C20H25N9O2/c21-17(22)7-9-25-19(30)13-3-1-5-15(11-13)27-29-28-16-6-2-4-14(12-16)20(31)26-10-8-18(23)24/h1-6,11-12,21,23,25-27H,7-10,22,24H2
charge 0 multiplicity 1
56 atoms
O  2.263774 0.134915 1.01673
O  -4.652638 2.920294 0.547281
N  4.061286 -0.313043 -0.378811
N  -2.554447 2.251172 -0.211529
N  -0.898851 -3.781632 -0.075152
N  -2.994506 -3.016844 -0.031142
N  -1.725032 -2.699145 0.004729
N  3.470954 4.285416 -0.674586
N  -0.211143 1.49561 1.769139
N  5.555355 3.672441 -1.789096
N  1.286731 2.984669 0.652732
C  4.557297 1.080495 -0.358576
C  -1.935628 3.58013 -0.116969
C  3.862515 1.971827 -1.426304
C  2.441128 -2.104095 0.093507
C  -1.016843 3.744306 1.130682
C  2.921524 -0.690067 0.288797
C  -4.301992 0.549308 0.107392
C  1.045359 -2.298734 0.123094
C  0.499982 -3.591347 -0.066461
C  -3.861997 1.996868 0.170364
C  3.312387 -3.20865 -0.097517
C  -3.386988 -0.524492 0.077218
C  1.365538 -4.700984 -0.254945
C  -3.854328 -1.866553 0.021463
C  2.762029 -4.50015 -0.261234
C  -5.697704 0.280884 0.1091
C  4.349082 3.416711 -1.307596
C  0.10715 2.718507 1.181651
C  -5.247519 -2.125619 0.007705
C  -6.161913 -1.049895 0.056734
H  4.375294 1.486334 0.651056
H  5.644531 1.079993 -0.543542
H  -2.754436 4.317699 -0.065216
H  -1.342883 3.76673 -1.030452
H  4.129481 1.607769 -2.432845
H  2.766834 1.914437 -1.310436
H  -0.561195 4.747716 1.092295
H  -1.639572 3.682238 2.042667
H  4.478973 -0.967694 -1.042939
H  -1.969858 1.482554 -0.540005
H  0.384397 -1.445794 0.284789
H  4.400091 -3.079219 -0.073529
H  -2.304531 -0.36605 0.122221
H  0.954104 -5.70777 -0.394499
H  -6.386345 1.130315 0.1583
H  3.425545 -5.361472 -0.391226
H  -5.587152 -3.165515 -0.036034
H  -7.237973 -1.25237 0.052643
H  -1.31832 -4.719065 -0.168854
H  3.759282 5.251624 -0.518745
H  2.567228 3.964866 -0.252561
H  0.506349 0.760805 1.797442
H  -1.09395 1.364747 2.258368
H  5.847269 4.663584 -1.649117
H  1.929575 2.170135 0.77432
