program: Gaussian 09
title: 000205785
version: EM64L-G09RevD.01
frameworkgroup: C1[X(C17H20N8O)]
method: RPBEPBE
basis: SDD
operation: Freq
keyword: #p
keyword: freq=noraman
keyword: PBEPBE/SDD
title: #p freq=noraman PBEPBE/SDD
converged: NO YES NO NO
title: Mulliken charges:
elementType: O N N N N N N N N C C C C C C C C C C C C C C C C C H H H H H H H H H H H H H H H H H H H H
charge: -0.282589 -0.388089 -0.397172 -0.166898 -0.633077 -0.010034 -0.338737 -0.656863 -0.377659 -0.383006 -0.449167 0.276959 0.153146 -0.333224 -0.345751 0.124547 0.173222 -0.372218 -0.300610 0.489077 0.363946 -0.392182 -0.421475 -0.338747 -0.341394 0.072889 0.258895 0.238853 0.247469 0.230889 0.311857 0.215560 0.276358 0.249885 0.260902 0.264587 0.227147 0.218457 0.287490 0.309037 0.322483 0.312179 0.200659 0.314777 0.314955 0.212667
chargesum: 0.00000
title: Mulliken charges with hydrogens summed into heavy atoms:
elementType: O N N N N N N N N C C C C C C C C C C C C C C C C C
charge: -0.282589 -0.076232 -0.088135 -0.166898 0.001586 -0.010034 -0.138079 -0.027131 -0.164992 0.114741 0.029190 0.276959 0.153146 -0.117663 -0.069392 0.124547 0.173222 -0.122333 -0.039708 0.489077 0.363946 -0.127595 -0.194327 -0.120290 -0.053904 0.072889
polarizability: 6.48063714e+02 -5.73697394e+00 2.36765227e+02 -4.42698365e+01 1.35215622e+00 1.28951636e+02
1716.lowfreq: -12.0558 -2.4099 -0.0007 0.0008 0.0015 1.7364 5.4639 11.1216 21.5173
frequency: -9.2723 11.0727 21.3818 26.1730 30.0787 32.1286 45.7473 61.6290 63.3375 80.6409 111.8500 123.8783 150.7090 172.2887 196.6538 208.1446 212.7769 232.3309 293.5861 311.6604 314.2927 343.9380 369.8595 390.5650 393.2337 404.8140 409.9445 416.2442 424.3545 447.4280 451.2667 464.2716 471.7111 477.8541 492.2945 514.1503 531.5883 541.7228 576.4713 601.5006 630.9653 632.2357 646.9398 658.2654 665.0923 686.3918 722.8801 723.0007 747.8449 761.1979 766.3560 809.2384 811.5704 827.4659 834.0102 835.5150 839.8823 853.1943 870.8595 876.8286 917.2185 964.4474 965.3632 973.4826 989.9681 998.2521 1002.8733 1003.5792 1014.0320 1035.2565 1052.7123 1072.2714 1075.5498 1091.6300 1113.0772 1116.2618 1139.8495 1144.4357 1165.3970 1170.2512 1186.9724 1188.5218 1219.3709 1244.6608 1262.8320 1281.6818 1301.8421 1307.0284 1310.2215 1345.5250 1350.3797 1368.7148 1375.0068 1384.6338 1389.8777 1420.7040 1424.4242 1443.9968 1462.4256 1473.0646 1484.3626 1502.9431 1518.7449 1554.4714 1577.6976 1593.1652 1601.5883 1611.9655 1615.2329 1622.7639 1637.0524 1638.8552 3016.2155 3021.9035 3092.1618 3100.2255 3124.9828 3126.2158 3130.8224 3151.0262 3163.3659 3171.3311 3173.5140 3183.0124 3300.4413 3328.8580 3383.3396 3519.1112 3537.5713 3566.9186 3667.1535 3681.2346
redmass: 4.8659 6.5507 5.2771 4.6353 5.5419 5.5110 4.9814 4.1196 5.5718 3.9862 5.2983 5.3922 5.3365 5.7432 5.4539 5.2404 5.1488 4.7335 4.5393 5.1780 2.8383 5.1979 4.6857 1.3067 1.8695 2.6538 3.0739 1.9528 2.5564 1.3592 1.7099 1.5016 3.0794 3.7432 2.3707 2.9800 3.0325 4.0062 1.2313 4.8665 6.4323 5.7604 3.3585 4.0602 3.5462 3.8429 1.3275 4.1584 4.0338 3.0892 4.3854 1.3478 5.0060 2.3045 1.5483 1.3648 1.4682 1.6783 2.2815 1.6507 4.5462 1.3780 1.4186 2.4175 1.3918 2.7699 2.7657 1.4257 1.8851 1.8292 2.1757 1.5211 2.0149 1.5694 1.4718 1.3825 2.4013 2.8296 2.3430 1.5312 1.1632 1.2570 2.8122 1.4835 2.0049 1.9808 1.3443 1.2858 1.3579 7.2699 1.4137 4.9812 5.1616 2.2589 4.3748 4.2027 3.8196 1.1677 1.1370 1.9010 1.9810 2.2036 3.1776 7.0256 4.8950 6.6669 3.7327 5.5533 1.6524 6.2775 1.3636 2.4331 1.0640 1.0591 1.1024 1.1024 1.0902 1.0886 1.0894 1.0882 1.0950 1.0945 1.0960 1.0943 1.0757 1.0762 1.0744 1.0449 1.0452 1.0772 1.1038 1.1034
irintensity: 1.3343 0.6841 0.5161 11.0479 2.0381 0.7005 8.2485 8.7154 4.5813 3.1462 1.2370 5.2501 8.9594 3.9329 2.5076 7.7333 11.4635 2.7714 2.3426 42.6436 5.2033 10.5231 0.7259 356.8892 4.3026 65.5368 0.5655 62.0556 12.3053 190.4419 16.1068 73.9987 9.8789 36.1987 18.7093 19.8489 6.5493 30.1356 30.3773 2.4077 2.0032 4.2824 2.7467 22.0420 12.2823 24.7430 87.9098 22.6542 6.2353 4.3096 4.5157 60.2687 4.4436 47.2179 39.9707 10.6926 15.1351 111.2099 13.5917 54.3137 0.9029 0.1364 1.6441 6.7122 8.9665 14.6080 2.4244 0.4863 20.1932 5.2202 16.6057 223.3401 0.2657 96.2420 72.0262 2.3585 12.2265 5.2799 235.5605 31.8057 10.9606 19.9655 75.6045 34.7702 570.2643 155.4396 136.5706 45.3878 0.2874 368.6166 24.5570 85.4405 96.2709 62.6537 82.7985 5.7910 12.1821 52.9842 18.5670 450.8591 3.2454 193.8001 321.8614 48.4202 13.4660 120.6424 97.0529 47.5809 38.5082 132.7722 192.5514 218.0776 11.7081 37.5490 6.2468 19.0447 16.4661 30.4843 17.5389 0.2959 10.5192 2.3884 1.1526 2.2905 30.7826 28.9078 15.9429 16.1128 21.0259 18.5720 12.4770 20.1419
temp: 298.150 k
press: 1.00000 atm
elementType: 8 7 7 7 7 7 7 7 7 6 6 6 6 6 6 6 6 6 6 6 6 6 6 6 6 6 1 1 1 1 1 1 1 1 1 1 1 1 1 1 1 1 1 1 1 1
symmnumber: 1
zpe: 949651.6 jmol-1
zpe.correction: 0.361703 hartree
zpe.thermalcorrener: 0.386011 hartree
zpe.thermalcorrenthalpy: 0.386955 hartree
zpe.thermalcorrgfe: 0.303442 hartree
zpe.sumelectzpe: -1171.138538 hartree
zpe.sumelectthermal: -1171.114230 hartree
zpe.sumelectthermalent: -1171.113286 hartree
zpe.sumelectthermalfe: -1171.196799 hartree
dipole: -4.2011 -0.8588 1.2215
dipole: 4.4585
quadrupole: -175.3966 -137.3625 -154.2749
quadrupole: -41.0792 13.7786 3.3849
quadrupole: -19.7186 18.3155 1.4031 -41.0792 13.7786 3.3849
hfenergy: -1171.5002409 hartree
pointgroup: C01 [X(C17H20N8O1)]
dipole: 1.6797057 0.2923715 -0.412371 debye
polarizability: 650.6885678|23.0070558|136.8111793|7.19784|33.0439251|226.2808308 unknown
InChI: InChI=1S/C17H20N8O/c18-15(19)9-10-22-17(26)12-3-7-14(8-4-12)24-25-23-13-5-1-11(2-6-13)16(20)21/h1-8,18,20,22-23H,9-10,19,21H2
charge 0 multiplicity 1
46 atoms
O  -4.597757 0.169974 2.243279
N  -5.558674 -0.246131 0.168856
N  2.999806 -0.628992 -1.218727
N  0.800755 -0.817077 -1.270742
N  -6.38619 2.425578 -1.352487
N  1.829262 -0.403687 -0.561602
N  -8.713976 1.74001 -1.480073
N  8.294596 0.936912 2.256983
N  9.175946 0.755651 0.009427
C  -6.93477 -0.091436 0.665604
C  -7.46949 1.367436 0.591256
C  -3.103075 -0.307935 0.385489
C  -4.461398 -0.112122 1.00772
C  -2.888021 -0.931236 -0.872781
C  -1.976205 0.144859 1.125655
C  -7.572759 1.882829 -0.83861
C  -0.464703 -0.609926 -0.645335
C  -1.584884 -1.078776 -1.382816
C  -0.673648 0.004275 0.624999
C  4.248198 -0.278074 -0.666589
C  6.811181 0.385422 0.375179
C  4.355656 0.346744 0.602629
C  5.422415 -0.557814 -1.418289
C  5.628509 0.67127 1.108219
C  6.683583 -0.226132 -0.899584
C  8.18434 0.707989 0.880217
H  -6.939687 -0.414025 1.720419
H  -7.599831 -0.752572 0.082389
H  -8.484673 1.381376 1.019876
H  -6.821715 2.016727 1.208635
H  -5.419351 -0.329367 -0.838162
H  -3.724624 -1.341481 -1.450597
H  -2.163047 0.599502 2.10418
H  -1.403139 -1.563987 -2.347071
H  0.188939 0.356764 1.197714
H  3.449167 0.576556 1.167308
H  5.342707 -1.033947 -2.403419
H  5.681397 1.193295 2.070811
H  7.60136 -0.420185 -1.462347
H  2.942841 -1.074366 -2.148672
H  -5.568625 2.544473 -0.756802
H  -6.358184 2.825667 -2.289278
H  -8.685073 2.090424 -2.462221
H  7.536215 0.719679 2.899009
H  9.192155 1.201494 2.657198
H  10.100771 0.95586 0.44295
