program: Gaussian 09
title: 000205780
version: EM64L-G09RevD.01
frameworkgroup: C1[X(C12H15Cl2NO2)]
method: RPBEPBE
basis: SDD
operation: Freq
keyword: #p
keyword: freq=noraman
keyword: PBEPBE/SDD
title: #p freq=noraman PBEPBE/SDD
converged: YES YES NO NO
title: Mulliken charges:
elementType: Cl Cl O O N C C C C C C C C C C C C H H H H H H H H H H H H H H H
charge: -0.062073 -0.061765 -0.456527 -0.268905 -0.134445 0.491144 -0.418202 -0.419692 -0.584972 0.376698 -0.372220 0.113276 -0.555876 -0.556784 -0.357521 -0.791510 0.088267 0.240608 0.277073 0.241352 0.277800 0.227693 0.227554 0.291640 0.266064 0.293198 0.266097 0.276039 0.205974 0.250395 0.250591 0.379030
chargesum: 0.00000
title: Mulliken charges with hydrogens summed into heavy atoms:
elementType: Cl Cl O O N C C C C C C C C C C C C
charge: -0.062073 -0.061765 -0.077498 -0.268905 -0.134445 0.491144 0.099480 0.099461 -0.357279 0.376698 -0.144666 0.113276 0.001828 0.002510 -0.081482 -0.084550 0.088267
polarizability: 2.57063483e+02 -5.62729809e-01 1.34409824e+02 -1.64955788e+00 2.52863063e+01 1.32141200e+02
1716.lowfreq: -11.8680 -3.7384 -0.0022 -0.0016 -0.0014 4.3730 27.9640 30.8790 50.1734
frequency: 27.9137 30.6902 50.1447 66.3959 71.9554 84.5972 90.8280 125.9995 168.6294 173.3914 184.1907 210.1500 235.6900 282.9919 300.2802 323.7334 364.9513 377.4346 423.6184 447.7469 470.4609 506.4648 543.2485 545.7016 559.6290 570.9335 598.3387 602.0575 608.5733 660.5103 687.9671 716.7304 760.0734 816.6270 821.7438 856.3112 871.0106 920.2311 927.3823 950.7175 978.4998 983.4093 1005.4102 1007.2095 1042.1821 1043.9794 1055.3059 1118.5000 1161.8239 1172.4213 1178.6382 1188.7830 1205.8826 1242.6073 1260.6736 1293.4736 1303.4276 1305.3939 1312.8113 1351.7097 1356.1258 1376.7090 1391.8530 1406.3707 1429.4977 1439.2267 1440.3346 1453.6377 1465.4296 1477.6179 1493.6550 1516.8198 1549.0890 1625.8844 1631.7182 2983.5425 2986.0843 2991.5227 3056.2065 3056.5256 3076.9453 3079.4680 3083.0302 3090.0159 3144.5377 3145.7173 3151.6208 3157.9478 3180.9514 3533.1279
redmass: 10.6586 10.9272 9.3566 5.8613 6.4544 5.6212 4.8305 3.1437 3.5219 3.9004 1.3757 3.0661 3.8955 3.6608 4.4728 5.0951 3.3059 3.3342 3.1153 2.8196 2.6551 3.3229 3.2568 2.9785 1.5469 4.6033 2.5123 4.1963 3.9198 4.1158 3.3114 5.2814 4.0380 2.6225 1.6020 1.5290 1.8262 1.9384 2.5478 2.2029 1.3555 5.3489 1.6624 1.8641 2.6648 1.5805 1.6174 1.9105 1.1879 1.6943 1.5949 1.7480 1.4509 1.4855 1.5121 1.3259 1.3245 1.1841 2.6755 1.3826 1.4425 2.6798 2.3846 1.3715 1.7901 1.0961 1.1292 1.0450 1.0976 1.4446 1.2457 2.5629 7.3685 6.3543 7.3347 1.0681 1.0686 1.0367 1.0582 1.0579 1.0938 1.0960 1.0935 1.1012 1.1090 1.1097 1.0909 1.0872 1.0958 1.0641
irintensity: 0.5274 0.8848 0.6686 0.4427 5.7346 1.4712 4.1209 3.5064 0.7143 1.3991 2.4113 0.8618 4.1475 2.7624 0.9309 3.0595 2.1196 3.0042 10.6331 14.8530 5.7568 21.5791 44.7802 18.6196 49.2842 6.1404 52.6457 18.3135 14.1437 12.7756 43.8329 0.0236 11.8809 12.8694 24.7189 27.6655 0.2762 71.3419 14.1072 13.1722 1.9921 298.6058 3.5405 2.8319 7.0280 10.1062 9.0072 280.7530 19.3034 16.6458 17.9518 29.8922 5.7843 63.6985 4.0558 12.5431 17.7450 20.1620 108.1925 54.3076 139.0290 0.7269 72.7655 8.6882 47.2986 1.3583 14.7050 12.5608 23.7335 25.5367 3.2575 107.6785 110.2110 666.0901 178.2937 31.8793 17.3325 19.3374 27.0897 6.7988 1.2930 8.5243 5.5900 21.8195 21.4075 22.0865 14.0289 8.4758 9.4799 51.3204
temp: 298.150 k
press: 1.00000 atm
elementType: 17 17 8 8 7 6 6 6 6 6 6 6 6 6 6 6 6 1 1 1 1 1 1 1 1 1 1 1 1 1 1 1
symmnumber: 1
zpe: 658062.1 jmol-1
zpe.correction: 0.250643 hartree
zpe.thermalcorrener: 0.268267 hartree
zpe.thermalcorrenthalpy: 0.269211 hartree
zpe.thermalcorrgfe: 0.202727 hartree
zpe.sumelectzpe: -1590.330929 hartree
zpe.sumelectthermal: -1590.313305 hartree
zpe.sumelectthermalent: -1590.312360 hartree
zpe.sumelectthermalfe: -1590.378845 hartree
dipole: 2.0967 -0.4791 -0.4526
dipole: 2.1979
quadrupole: -129.6031 -113.1887 -113.4484
quadrupole: 4.2157 3.9695 13.4059
quadrupole: -10.8564 5.5580 5.2984 4.2157 3.9695 13.4059
hfenergy: -1590.5815719 hartree
pointgroup: C01 [X(C12H15Cl2N1O2)]
dipole: 0.8252207 -0.1655174 -0.198347 debye
polarizability: 257.0400604|0.6954608|129.9056617|-2.497191|25.0692259|136.668785 unknown
InChI: InChI=1S/C12H15Cl2NO2/c1-9-8-10(2-3-11(9)12(16)17)15(6-4-13)7-5-14/h2-3,8,16H,4-7H2,1H3
charge 0 multiplicity 1
32 atoms
Cl 4.005439 -2.493569 0.991203
Cl 3.827572 2.555222 -0.957185
O  -4.223509 -1.195052 -1.193316
O  -4.623182 0.307039 0.522839
N  1.971516 -0.051414 -0.025993
C  0.571674 -0.109916 -0.061743
C  2.789901 -0.84261 -0.959614
C  2.678484 0.800987 0.943524
C  -0.232101 0.660255 0.838357
C  -1.641604 0.625039 0.834298
C  -0.118061 -0.94241 -1.002281
C  -2.30742 -0.215708 -0.119525
C  2.950364 -2.319832 -0.572863
C  2.733151 2.28828 0.565917
C  -1.515388 -0.981487 -1.020394
C  -2.388921 1.484781 1.837094
C  -3.77762 -0.302384 -0.18677
H  2.351756 -0.799641 -1.9769
H  3.783335 -0.371832 -1.039605
H  2.199571 0.718187 1.939985
H  3.702946 0.413727 1.068397
H  0.243257 1.314686 1.574613
H  0.428348 -1.558306 -1.720881
H  1.994946 -2.804927 -0.328236
H  3.491513 -2.882593 -1.349453
H  1.751443 2.696351 0.287071
H  3.19782 2.888601 1.363599
H  -2.028525 -1.620033 -1.744229
H  -1.681869 2.051457 2.467451
H  -3.068713 2.193121 1.332509
H  -3.037646 0.87273 2.487693
H  -5.217581 -1.19385 -1.173163
