program: Gaussian 09
title: 000205779
version: EM64L-G09RevD.01
frameworkgroup: C1[X(C18H12N2OS)]
method: RPBEPBE
basis: SDD
operation: Freq
keyword: #p
keyword: freq=noraman
keyword: PBEPBE/SDD
title: #p freq=noraman PBEPBE/SDD
converged: YES YES NO NO
title: Mulliken charges:
elementType: S O N N C C C C C C C C C C C C C C C C C C H H H H H H H H H H H H
charge: 0.333607 -0.249013 -0.438742 0.029250 0.186365 0.478952 -0.540774 0.332460 0.092667 0.101234 -0.775973 0.312828 -0.347237 -0.404630 -0.351603 -0.325579 -0.243162 -0.237218 -0.241885 -0.226634 -0.250169 -0.228053 0.285783 0.340096 0.255074 0.240800 0.284288 0.201237 0.227631 0.224807 0.228076 0.235155 0.233721 0.236641
chargesum: 0.00000
title: Mulliken charges with hydrogens summed into heavy atoms:
elementType: S O N N C C C C C C C C C C C C C C C C C C
charge: 0.333607 -0.249013 -0.098646 0.029250 0.186365 0.478952 -0.540774 0.332460 0.092667 0.101234 -0.490190 0.312828 -0.092164 -0.163829 -0.067315 -0.124341 -0.015530 -0.012411 -0.013810 0.008521 -0.016448 0.008588
polarizability: 4.28867029e+02 -4.52946937e+00 2.41708392e+02 -6.87225798e+00 7.99720890e+00 1.00004783e+02
1716.lowfreq: -7.8760 -3.9356 -0.0016 -0.0012 0.0006 2.4064 3.9623 27.0546 48.3824
frequency: -5.5605 27.0107 48.3594 73.2956 79.3436 115.5011 141.6999 171.2587 190.1495 210.9531 246.0417 291.4172 306.1344 315.5453 333.1022 393.9111 398.1750 406.7236 437.0091 465.4125 490.7143 532.1854 565.6695 590.8893 610.7647 615.5602 626.2858 634.0218 644.7307 685.1452 691.4612 694.4629 699.3103 739.0240 752.7358 769.0204 781.9283 793.5767 801.3077 813.3792 846.6544 847.9753 915.9105 927.8878 932.8254 958.7886 971.9950 985.9677 988.5918 988.8459 993.4718 1011.5531 1024.0681 1029.7954 1061.3657 1084.3990 1089.8915 1105.0777 1172.9686 1175.4036 1196.0428 1197.2250 1199.0147 1211.9541 1278.5612 1290.2056 1320.5164 1326.1506 1371.9499 1383.9432 1389.6875 1421.9095 1427.8369 1444.8735 1447.2537 1475.8506 1490.0813 1515.2410 1526.4848 1584.5859 1591.0032 1612.7111 1613.0028 1639.8257 3120.3607 3121.5704 3131.1002 3136.5709 3144.1743 3150.0276 3159.8936 3164.9283 3176.3692 3180.2221 3230.2037 3519.5778
redmass: 3.8245 6.5234 4.8711 4.8893 6.2520 6.1572 7.0416 5.7596 5.5662 5.7869 8.0110 7.2348 7.0112 6.3730 7.1886 5.4384 3.0010 2.8460 10.6685 4.0475 4.6554 7.0051 4.6757 8.8474 4.9746 6.4724 3.6355 7.7487 6.1737 4.7160 1.7903 4.2378 1.8703 1.8785 1.4277 2.1728 2.9095 3.2261 3.4468 8.0097 1.2552 1.2617 1.9550 2.9040 1.4359 8.6973 1.3904 1.3917 4.8521 3.8835 1.5846 1.3470 2.6549 2.2370 2.8768 1.6151 1.6197 3.3569 1.0548 1.0596 1.2747 1.4777 1.2203 2.6417 4.3105 2.4772 1.4025 1.4982 4.8983 7.2318 4.3072 4.0774 2.8435 3.2380 2.7414 3.0198 3.2366 4.5764 5.0151 6.0405 5.8662 6.0154 6.0701 6.4790 1.0871 1.0851 1.0883 1.0871 1.0939 1.0926 1.0988 1.0967 1.0989 1.0965 1.0949 1.0765
irintensity: 0.0164 1.1030 0.2891 0.4926 0.0540 0.1239 0.7320 9.8705 0.9522 0.1215 2.2974 0.3230 0.7728 0.5900 0.1726 1.2366 0.2394 0.1721 0.4039 6.3029 8.7636 3.0629 1.7101 0.3883 1.1241 0.0348 2.0744 2.9811 22.9596 2.5117 49.9218 14.2629 47.3751 11.3890 140.6432 32.7400 69.4997 5.8883 4.4454 14.5897 1.7247 0.6496 14.1472 11.8969 5.0392 23.4834 2.1577 0.3226 0.6386 0.0105 0.4616 0.7910 8.2993 1.0961 24.2601 7.4132 22.0551 20.5511 0.0133 0.7901 4.2626 0.7458 6.3330 20.4519 38.7191 14.1908 4.0527 9.4292 2.0438 0.2169 12.5707 15.6680 5.8010 17.0104 9.1250 29.7480 150.1552 11.2565 184.0700 4.5003 4.0590 2.6923 1.5837 476.7263 14.7227 4.0597 3.8332 0.3575 30.7660 22.5240 42.9529 19.6096 19.3225 5.4495 2.9578 33.1905
temp: 298.150 k
press: 1.00000 atm
elementType: 16 8 7 7 6 6 6 6 6 6 6 6 6 6 6 6 6 6 6 6 6 6 1 1 1 1 1 1 1 1 1 1 1 1
symmnumber: 1
zpe: 660862.4 jmol-1
zpe.correction: 0.251709 hartree
zpe.thermalcorrener: 0.268013 hartree
zpe.thermalcorrenthalpy: 0.268957 hartree
zpe.thermalcorrgfe: 0.206904 hartree
zpe.sumelectzpe: -1274.443318 hartree
zpe.sumelectthermal: -1274.427014 hartree
zpe.sumelectthermalent: -1274.426070 hartree
zpe.sumelectthermalfe: -1274.488123 hartree
dipole: 2.8580 0.0185 -0.0984
dipole: 2.8597
quadrupole: -102.4727 -128.8872 -138.3832
quadrupole: -10.4710 -0.3802 4.1503
quadrupole: 20.7750 -5.6395 -15.1355 -10.4710 -0.3802 4.1503
hfenergy: -1274.6950268 hartree
pointgroup: C01 [X(C18H12N2O1S1)]
dipole: -1.1233034 -0.0054879 -0.0633799 debye
polarizability: 428.2231905|-3.5307341|226.7178091|15.2270781|-44.5930449|115.6392042 unknown
InChI: InChI=1S/C18H12N2OS/c21-17-15-14(12-7-3-1-4-8-12)11-22-18(15)20-16(19-17)13-9-5-2-6-10-13/h1-11,19H
charge 0 multiplicity 1
34 atoms
S  0.493081 -3.002421 0.689362
O  0.919469 2.027271 -0.298286
N  -1.177547 1.033791 -0.159651
N  -1.603229 -1.256629 0.266592
C  0.74472 -0.397587 0.126271
C  2.107671 -0.890412 0.274452
C  -0.244562 -1.397953 0.318266
C  3.383494 -0.132887 0.145146
C  0.25945 0.961964 -0.123166
C  -2.063529 -0.021905 0.019091
C  2.117682 -2.249924 0.573397
C  -3.524609 0.219505 -0.060045
C  3.596744 0.813128 -0.892614
C  4.449251 -0.401754 1.048412
C  -4.403023 -0.860675 0.23019
C  -4.079573 1.48023 -0.415073
C  4.842926 1.460371 -1.027109
C  5.695431 0.246506 0.913189
C  5.898916 1.180187 -0.128824
C  -5.798315 -0.682891 0.171983
C  -5.478093 1.65474 -0.472328
C  -6.343195 0.575927 -0.17811
H  2.992721 -2.886234 0.694255
H  -1.529379 1.982278 -0.319214
H  2.785771 1.04923 -1.585931
H  4.288248 -1.101281 1.87719
H  -3.961385 -1.825018 0.496823
H  -3.444237 2.339042 -0.664503
H  4.987381 2.187914 -1.83338
H  6.500277 0.031652 1.625115
H  6.86376 1.68875 -0.234447
H  -6.462523 -1.523409 0.399527
H  -5.891799 2.630187 -0.74922
H  -7.428793 0.71461 -0.22306
