program: Gaussian 09
title: 000205771
version: EM64L-G09RevD.01
frameworkgroup: C1[X(C15H19N3)]
method: RPBEPBE
basis: SDD
operation: Freq
keyword: #pfreq=noraman
keyword: PBEPBE/SDD
title: #p freq=noraman PBEPBE/SDD
converged: YES YES NO NO
title: Mulliken charges:
elementType: N N N C C C C C C C C C C C C C C C H H H H H H H H H H H H H H H H H H H
charge: -0.399619 -0.064318 -0.693011 -0.566002 0.522746 -0.398010 0.322456 -0.612062 0.317577 -0.434845 -0.415134 -0.822703 0.106801 -0.809088 0.240435 -0.292975 -0.192945 -0.360808 0.206510 0.237926 0.257666 0.213816 0.248139 0.231560 0.226804 0.305720 0.231010 0.218575 0.229689 0.225909 0.220576 0.228224 0.218935 0.220041 0.229448 0.295479 0.305479
chargesum: 0.00000
title: Mulliken charges with hydrogens summed into heavy atoms:
elementType: N N N C C C C C C C C C C C C C C C
charge: -0.093900 -0.064318 -0.092053 -0.121567 0.522746 0.073473 0.322456 -0.363922 0.317577 -0.203285 -0.188330 -0.143429 0.106801 -0.134378 0.240435 -0.074040 0.027095 -0.131360
polarizability: 2.41177286e+02 5.11948481e-02 1.95320126e+02 3.84331980e+01 3.85330389e-01 1.19430931e+02
1716.lowfreq: -11.6771 -6.1770 -0.0003 0.0003 0.0003 4.3274 7.3142 12.8481 26.8962
frequency: -10.0224 10.8462 26.8405 68.6585 77.1922 113.8181 131.8835 148.9229 159.2645 204.6019 226.0200 261.9382 283.3099 291.7158 298.8268 314.5825 353.0502 417.9740 433.0729 448.8304 458.4072 477.6956 485.0560 510.6996 528.4966 545.5512 554.0503 573.6845 590.7649 614.2232 700.0658 726.9482 736.9983 744.8297 758.1928 778.5910 823.1835 843.6124 882.9871 886.1908 893.4488 912.0000 933.4918 953.6276 964.3433 987.8119 1004.3572 1023.9601 1027.4964 1029.4542 1051.9961 1059.3658 1094.1469 1127.8791 1128.6312 1162.3606 1177.2060 1199.0589 1218.2388 1255.4570 1261.9139 1290.4045 1297.5057 1305.1341 1316.5432 1364.2732 1372.9845 1381.2317 1392.0832 1403.6776 1408.8820 1432.8210 1440.4178 1451.8456 1461.8813 1468.5754 1471.0878 1474.4279 1477.1020 1499.4195 1504.9315 1573.2464 1583.4172 1592.0112 1622.4870 1641.0203 2964.7700 2966.5522 2990.4307 3003.8254 3035.2494 3038.9686 3054.1665 3073.7095 3077.8813 3082.0332 3108.0954 3110.0078 3120.8013 3131.6014 3133.4529 3168.1916 3484.0636 3581.8916 3627.7821
redmass: 4.4277 4.6427 3.7679 4.1972 4.0867 1.1267 3.0270 1.2136 2.6519 2.6817 3.0539 2.5408 2.4256 2.6762 2.8781 1.3775 3.0237 3.7859 2.6648 2.8498 3.2662 1.3780 2.3312 3.7072 4.2146 4.2946 1.3979 3.4289 3.7024 3.4706 3.9946 2.8633 4.1773 3.4396 3.1250 1.7174 1.7237 2.2765 1.3912 2.1844 3.0680 1.5994 1.3498 1.3551 1.9996 1.6799 1.5991 1.9062 1.9937 1.4554 1.6375 2.1109 2.6748 1.4851 1.8144 1.5611 1.2140 1.6395 1.8277 2.6786 1.6541 1.4135 1.9393 1.9195 1.3827 1.4651 4.0387 3.2660 1.2384 1.3518 2.3065 2.2956 1.6053 1.3015 1.0484 1.1283 1.1614 1.0506 1.1735 2.6450 2.9360 5.1960 6.3027 4.6088 6.2674 1.2059 1.0376 1.0380 1.0607 1.0606 1.0968 1.0968 1.1002 1.1047 1.0984 1.0978 1.0871 1.0908 1.0891 1.0898 1.0967 1.0992 1.0469 1.0770 1.0990
irintensity: 4.5260 0.3764 0.1924 3.6278 2.6489 0.0302 0.2870 1.5088 0.4098 5.2655 0.6322 4.8694 0.3503 6.5141 15.1788 54.7764 2.6581 1.6976 0.8618 15.0302 3.6805 120.7739 46.3078 6.1336 4.0883 2.4638 146.6455 53.7660 23.8855 2.8251 0.0949 9.1162 0.2753 14.2350 31.5940 46.2379 25.5018 12.1069 1.2224 1.9826 0.9968 4.1781 1.8363 0.6416 5.0855 3.3088 6.6808 17.9888 2.9823 13.3183 0.0765 4.6992 9.2167 26.3332 24.1647 4.7982 0.4491 8.8840 1.3468 5.0871 19.5654 3.4697 30.2820 52.4660 17.1745 24.5353 5.5993 8.4567 5.1339 18.3823 0.7476 23.0615 60.7717 5.2361 0.1315 11.0586 20.9127 30.7778 1.1043 190.9332 160.5839 94.5043 1.6579 104.8137 3.5090 76.0137 49.0774 31.7189 28.4981 47.9812 45.3003 1.7771 24.2673 14.4538 33.1654 12.7285 8.6404 35.2048 14.8942 24.4073 26.4741 33.8314 13.7025 25.9614 19.8619
temp: 298.150 k
press: 1.00000 atm
elementType: 7 7 7 6 6 6 6 6 6 6 6 6 6 6 6 6 6 6 1 1 1 1 1 1 1 1 1 1 1 1 1 1 1 1 1 1 1
symmnumber: 1
zpe: 813094.0 jmol-1
zpe.correction: 0.309691 hartree
zpe.thermalcorrener: 0.326664 hartree
zpe.thermalcorrenthalpy: 0.327608 hartree
zpe.thermalcorrgfe: 0.263695 hartree
zpe.sumelectzpe: -745.945651 hartree
zpe.sumelectthermal: -745.928678 hartree
zpe.sumelectthermalent: -745.927734 hartree
zpe.sumelectthermalfe: -745.991647 hartree
dipole: 2.2478 2.9240 1.1967
dipole: 3.8774
quadrupole: -107.4149 -95.6916 -109.9739
quadrupole: -5.0753 4.2119 0.1150
quadrupole: -3.0547 8.6685 -5.6138 -5.0753 4.2119 0.1150
hfenergy: -746.2553417 hartree
pointgroup: C01 [X(C15H19N3)]
dipole: -0.8085487 1.2000666 -0.4829425 debye
polarizability: 232.9302743|-3.7533171|195.2974701|48.9410585|2.3472562|127.7005983 unknown
InChI: InChI=1S/C15H19N3/c1-11-5-6-13(10-12(11)2)7-9-18-15-14(16)4-3-8-17-15/h3-6,8,10,18H,7,9,16H2,1-2H3
charge 0 multiplicity 1
37 atoms
N  1.188072 -0.777572 -0.842778
N  2.987207 -1.135788 0.657341
N  1.773978 1.951694 -1.033382
C  -0.420411 -2.17056 0.510607
C  -1.608255 -1.260288 0.252789
C  0.638973 -2.119032 -0.636978
C  -2.670583 0.979284 0.425636
C  -1.603094 0.087757 0.696751
C  -3.794847 0.513568 -0.32279
C  -2.730671 -1.70826 -0.48641
C  -3.80241 -0.831771 -0.766532
C  -2.620157 2.408277 0.939945
C  2.279618 -0.283176 -0.132907
C  -4.966707 1.43133 -0.626074
C  2.611406 1.117798 -0.257235
C  3.777426 1.571176 0.390463
C  4.550047 0.667303 1.16784
C  4.099751 -0.659905 1.29603
H  -0.75175 -3.222263 0.614869
H  0.093386 -1.893096 1.449312
H  1.469435 -2.801119 -0.382852
H  0.177911 -2.457605 -1.58326
H  -0.749456 0.444099 1.288307
H  -2.770036 -2.747341 -0.837328
H  -4.666437 -1.198517 -1.334565
H  0.819879 -0.204299 -1.600128
H  -1.687141 2.600233 1.49725
H  -2.683901 3.145485 0.115566
H  -3.466879 2.625336 1.619724
H  -5.452989 1.792216 0.301299
H  -4.649271 2.331684 -1.187221
H  -5.733265 0.912729 -1.226868
H  4.068489 2.626139 0.311847
H  5.458153 0.999787 1.679334
H  4.637398 -1.385437 1.916549
H  2.06887 2.917368 -1.17478
H  0.763462 1.810366 -0.961672
