program: Gaussian 09
title: 000213647
version: EM64L-G09RevD.01
frameworkgroup: C1[X(C22H23N3O2)]
method: RPBEPBE
basis: SDD
operation: Freq
keyword: #p
keyword: freq=noraman
keyword: PBEPBE/SDD
title: #p freq=noraman PBEPBE/SDD
converged: YES YES NO NO
title: Mulliken charges:
elementType: O O N N N C C C C C C C C C C C C C C C C C C C C C C H H H H H H H H H H H H H H H H H H H H H H H
charge: -0.239823 -0.288468 -0.099437 -0.418483 -0.410133 -0.053149 -0.474570 -0.429416 -0.384636 -0.377687 -0.433181 0.067780 0.168029 0.197595 0.143177 -0.332292 0.259851 0.209536 -0.393423 -0.354538 -0.351138 -0.353618 -0.244522 -0.213641 -0.224091 -0.238993 -0.227230 0.271265 0.214463 0.217741 0.246302 0.200523 0.172047 0.247377 0.218073 0.193079 0.227549 0.223354 0.302704 0.301154 0.311730 0.288187 0.231140 0.275521 0.211041 0.224775 0.224252 0.232026 0.229704 0.232491
chargesum: 0.00000
title: Mulliken charges with hydrogens summed into heavy atoms:
elementType: O O N N N C C C C C C C C C C C C C C C C C C C C C C
charge: -0.239823 -0.288468 -0.099437 -0.115779 -0.098403 0.218115 -0.042366 0.017409 0.034788 0.033466 0.017722 0.067780 0.168029 0.197595 0.143177 -0.031138 0.259851 0.209536 -0.105236 -0.123398 -0.075617 -0.142577 -0.019747 0.010611 0.007935 -0.009289 0.005261
polarizability: 3.76221588e+02 9.77438415e+00 2.62278250e+02 4.72033832e+01 -5.64646226e+00 1.60440998e+02
1716.lowfreq: -0.0004 0.0005 0.0010 2.8836 5.3336 13.5835 16.7100 18.5901 22.2014
frequency: 16.5267 18.3878 22.1998 32.5128 40.7129 53.5630 82.4880 93.5934 115.2660 119.2810 134.6281 176.7730 198.0529 220.3247 227.7269 250.2734 263.7138 286.4627 297.8498 347.8192 356.5337 383.7745 398.1165 402.4076 416.5341 426.5993 429.8229 466.9709 479.6317 500.5121 508.7233 522.7375 548.0780 572.1332 576.9069 594.9589 614.8558 625.4914 655.9264 657.9768 674.2788 687.2096 694.5116 705.3839 758.3601 762.7154 767.1566 780.0704 792.3072 804.5138 814.9011 854.4118 855.2053 866.9707 870.9038 879.0459 899.9010 933.8330 948.6215 956.8334 961.2495 984.8036 989.7310 991.0823 992.2257 998.0161 1006.7795 1010.6907 1013.4052 1026.1327 1054.1231 1081.5867 1086.1249 1087.5288 1105.7922 1120.2749 1122.5893 1135.8876 1144.2733 1157.9772 1168.5837 1173.1074 1183.3798 1189.0044 1190.8101 1234.6473 1241.3416 1251.6091 1257.1523 1268.9425 1289.5559 1294.1239 1308.6505 1315.9098 1320.3547 1335.1744 1349.0252 1355.1981 1359.6172 1366.7690 1384.8423 1389.4276 1393.2692 1423.1686 1431.8082 1449.3009 1450.3768 1453.9529 1459.0559 1461.7625 1475.7975 1482.7793 1484.4714 1493.8881 1516.3259 1562.2011 1566.5853 1590.5277 1603.1817 1611.3996 1631.8066 2808.4394 2855.0298 2895.7164 2997.7643 2998.6454 3001.4362 3025.5597 3031.6067 3037.5925 3061.8143 3072.8277 3116.7958 3127.5279 3131.1927 3139.7864 3144.4446 3157.9147 3159.2557 3169.1372 3183.3234 3229.1325 3553.6584 3598.0300
redmass: 6.0247 5.3857 4.2946 4.9618 5.3442 6.5834 3.6711 5.9663 4.7520 5.3730 5.0844 4.3719 3.3888 5.3520 4.4775 2.7962 3.2729 4.9061 2.8336 4.3392 3.0334 2.3152 4.4303 2.8238 2.8196 2.9384 3.4386 4.6103 3.3984 2.8780 4.7482 1.3649 4.0764 3.1040 2.4760 2.0742 6.3684 3.2315 3.8991 6.0640 3.0093 3.6698 3.0032 1.6687 1.3288 4.5928 4.6174 3.5383 2.4230 1.6311 4.0782 1.2559 1.7916 1.4479 2.8589 3.2348 2.6548 1.4580 1.3728 2.5019 3.2979 1.4227 4.9304 1.3486 2.1479 2.6332 1.3447 2.0893 1.6147 2.2741 2.1249 1.5882 1.7527 1.5714 2.5302 2.3754 1.6315 2.2977 2.4035 1.6904 1.3515 1.0598 1.2112 1.2964 1.1347 1.5917 1.5796 2.4962 1.7970 1.4756 1.4359 2.1982 1.6395 1.3372 1.3849 1.4811 1.5112 1.9120 1.6670 1.3802 9.0262 1.4680 5.3459 2.5334 2.2145 1.1207 3.5427 1.0907 1.1137 1.7241 1.1487 3.0263 1.2451 1.8415 5.9553 8.2009 6.6994 6.6446 6.6474 6.1002 7.2146 1.0713 1.0705 1.0666 1.0642 1.0626 1.0899 1.0869 1.0849 1.0873 1.1019 1.1004 1.0872 1.0858 1.0868 1.0913 1.0921 1.0956 1.0975 1.1006 1.0964 1.0996 1.0770 1.0809
irintensity: 0.8543 1.4116 3.3279 0.5535 0.4784 9.8678 0.8287 2.1877 1.5092 0.1338 1.3794 3.1470 4.4225 6.0306 5.6015 9.0423 6.3929 0.3878 0.7825 1.1422 8.4056 1.0337 0.1978 0.3629 0.9216 12.3796 6.4445 3.3653 2.3260 7.7764 12.6129 71.3569 6.1782 16.8919 29.5782 48.7232 0.6294 27.1311 9.7373 17.7551 9.0056 11.7160 4.7975 87.5768 103.2860 5.6570 10.2789 40.9737 18.1399 0.9546 0.9366 1.3829 13.2366 1.1616 4.3902 0.5679 34.1321 3.9097 3.9761 3.4127 47.6086 1.3803 1.5822 0.4687 4.0401 14.5517 1.5135 13.1326 6.8620 4.8677 13.0184 19.6045 19.7925 5.9190 19.9368 34.6061 31.6727 1.3071 32.2368 8.4980 11.7947 1.2408 5.3173 12.2926 10.2438 14.3787 22.1968 22.0903 78.8504 8.9330 12.5841 33.2952 11.6639 4.4233 10.2563 14.8096 13.5849 2.6828 9.2255 3.7098 1.6376 6.0305 96.6539 97.5947 12.3613 52.5161 24.4459 9.3033 42.7267 254.5347 9.8656 0.1777 24.1619 188.4648 42.5794 243.8059 110.8028 6.6795 47.2316 4.4253 1.2070 117.2289 110.0480 73.9269 19.6875 22.0957 16.1136 54.3626 22.7290 36.1710 35.1282 34.1586 14.1207 0.1889 1.8288 19.9652 24.2095 15.4717 31.0871 22.4469 7.5348 19.9350 19.9554 63.5071
temp: 298.150 k
press: 1.00000 atm
elementType: 8 8 7 7 7 6 6 6 6 6 6 6 6 6 6 6 6 6 6 6 6 6 6 6 6 6 6 1 1 1 1 1 1 1 1 1 1 1 1 1 1 1 1 1 1 1 1 1 1 1
symmnumber: 1
zpe: 1069340.5 jmol-1
zpe.correction: 0.407290 hartree
zpe.thermalcorrener: 0.430454 hartree
zpe.thermalcorrenthalpy: 0.431398 hartree
zpe.thermalcorrgfe: 0.351443 hartree
zpe.sumelectzpe: -1164.930204 hartree
zpe.sumelectthermal: -1164.907041 hartree
zpe.sumelectthermalent: -1164.906096 hartree
zpe.sumelectthermalfe: -1164.986051 hartree
dipole: -0.9637 -1.8007 -0.8365
dipole: 2.2070
quadrupole: -149.2740 -157.4864 -159.3642
quadrupole: 38.0938 9.5284 -5.6638
quadrupole: 6.1009 -2.1115 -3.9894 38.0938 9.5284 -5.6638
hfenergy: -1165.3374947 hartree
pointgroup: C01 [X(C22H23N3O2)]
dipole: -0.383958 0.6483439 0.4314689 debye
polarizability: 373.3065354|-0.2139858|261.8725482|-54.5136029|6.6546398|163.7617511 unknown
InChI: InChI=1S/C22H23N3O2/c26-21(19-14-23-20-9-5-4-8-18(19)20)15-25-12-10-17(11-13-25)24-22(27)16-6-2-1-3-7-16/h1-9,14,17,23-24H,10-13,15H2
charge 0 multiplicity 1
50 atoms
O  -2.772444 -2.30917 -1.292682
O  4.47846 2.355651 0.326825
N  -0.499917 0.441921 -0.805306
N  2.968679 0.602241 0.478886
N  -4.523559 1.654425 0.415309
C  1.815219 1.499682 0.715951
C  0.661521 0.720388 1.386195
C  1.31203 2.148774 -0.602232
C  -0.02275 -0.261229 0.412398
C  0.621683 1.119141 -1.515335
C  -1.240124 -0.475144 -1.707776
C  -2.542838 -1.066643 -1.122802
C  4.249856 1.101452 0.31863
C  -3.511409 -0.192905 -0.457791
C  -4.827177 -0.584754 0.048381
C  -3.376198 1.18659 -0.206161
C  5.357595 0.093985 0.12802
C  -5.439569 0.595454 0.589433
C  -5.539114 -1.810556 0.08946
C  -6.725499 0.594209 1.167923
C  6.583317 0.570908 -0.402878
C  5.240864 -1.278956 0.471686
C  -6.825798 -1.822059 0.666885
C  -7.412689 -0.637646 1.199742
C  7.665689 -0.309182 -0.60788
C  6.325998 -2.160021 0.269276
C  7.538948 -1.679114 -0.276234
H  2.179592 2.302413 1.382341
H  -0.0936 1.45044 1.731341
H  1.03039 0.174896 2.275441
H  2.164147 2.61949 -1.123083
H  0.590278 2.947488 -0.343446
H  0.674759 -1.099971 0.13869
H  -0.88954 -0.732049 0.910187
H  0.2117 1.624303 -2.409867
H  1.376524 0.374043 -1.877731
H  -1.508565 0.091278 -2.622683
H  -0.623605 -1.350005 -2.026982
H  2.792466 -0.39665 0.36601
H  -2.512382 1.815309 -0.412509
H  -4.679313 2.616777 0.710261
H  -5.082813 -2.714135 -0.32222
H  -7.178754 1.504402 1.575973
H  6.659422 1.63775 -0.637201
H  4.325238 -1.66977 0.932599
H  -7.390115 -2.760282 0.707977
H  -8.414711 -0.683672 1.640484
H  8.606358 0.069602 -1.022362
H  6.229436 -3.215838 0.545194
H  8.379715 -2.364057 -0.432641
