program: Gaussian 09
title: 000205705
version: EM64L-G09RevD.01
frameworkgroup: C1[X(C21H29NO)]
method: RPBEPBE
basis: SDD
operation: Freq
keyword: #p
keyword: freq=noraman
keyword: PBEPBE/SDD
title: #p freq=noraman PBEPBE/SDD
converged: YES YES NO NO
title: Mulliken charges:
elementType: O N C C C C C C C C C C C C C C C C C C C C C H H H H H H H H H H H H H H H H H H H H H H H H H H H H H
charge: -0.245043 -0.111560 -0.148900 -0.023510 -0.508163 -0.364885 0.366490 -0.372973 -0.778482 -0.333027 -0.327992 0.140411 -0.426384 -0.322523 -0.333170 -0.716675 0.402987 -0.271778 -0.378087 -0.478942 -0.441616 -0.277379 -0.253474 0.213163 0.184225 0.222941 0.207119 0.188409 0.229148 0.230198 0.187686 0.223887 0.220068 0.208552 0.208947 0.191237 0.196399 0.221897 0.229592 0.214105 0.185341 0.194614 0.213846 0.209982 0.209811 0.217937 0.223482 0.244661 0.238327 0.236693 0.224854 0.227553
chargesum: 0.00000
title: Mulliken charges with hydrogens summed into heavy atoms:
elementType: O N C C C C C C C C C C C C C C C C C C C C C
charge: -0.245043 -0.111560 0.064263 0.160715 -0.078103 0.052672 0.366490 0.044910 -0.125975 0.067157 0.090304 0.140411 -0.196793 0.076922 0.075291 -0.078945 0.402987 -0.048296 -0.133426 -0.240615 -0.204923 -0.052525 -0.025920
polarizability: 2.32857880e+02 -6.59792869e+00 2.65616860e+02 -3.38185543e+01 -2.03263548e+01 2.02637567e+02
1716.lowfreq: -12.9706 -10.0917 -6.6272 -0.0008 -0.0007 -0.0004 13.7393 26.9445 31.8341
frequency: 11.6228 26.8383 31.4850 35.5237 41.3741 53.6254 66.6454 110.4182 132.0973 137.5282 154.3172 181.5084 203.2709 220.2032 235.5364 245.1182 273.5002 279.9269 285.9455 314.8416 333.4937 371.0767 388.8816 405.4084 406.2529 420.0510 442.3966 466.5939 471.7985 473.7597 500.3806 521.9140 539.2863 579.8619 584.4432 618.1412 661.7972 700.6892 736.2869 743.0473 760.4627 784.2706 789.3934 799.5309 806.9343 810.2022 833.6585 839.7857 870.5871 878.6963 894.7656 907.1045 916.7577 937.3259 956.6773 963.0836 978.9704 988.1671 989.3090 997.1298 1010.5781 1027.5728 1031.6341 1036.8254 1044.6624 1052.1920 1073.8853 1083.8088 1089.9193 1102.6490 1115.8038 1126.4130 1137.9046 1141.3442 1151.3721 1155.9605 1173.1450 1183.7399 1188.6937 1204.9898 1222.4297 1233.5202 1242.4769 1252.8530 1261.0770 1264.4738 1277.4655 1283.1623 1291.2037 1296.6355 1315.2059 1323.8500 1331.2916 1339.3804 1341.5760 1346.0382 1360.1530 1370.0517 1381.0247 1381.9762 1385.8420 1388.9261 1403.3139 1413.3256 1440.0423 1442.6923 1445.4755 1450.3819 1454.0953 1457.7302 1459.5286 1465.0357 1472.0823 1474.2995 1475.9943 1484.7997 1495.7960 1516.8078 1584.9799 1596.4040 1629.4074 2851.6254 2856.7069 2871.7147 2945.8268 2947.1283 2950.7072 2965.5307 2971.1336 2973.0207 2981.7147 3019.0710 3025.3396 3028.9281 3031.4756 3034.4728 3051.1317 3064.5571 3066.6080 3070.7971 3078.8627 3078.8989 3082.0389 3115.4769 3117.8798 3126.0004 3129.0926 3150.6530 3151.8107 3165.1191
redmass: 4.3366 2.8613 3.3010 3.5617 2.3145 3.5474 3.4508 3.8964 3.0245 3.8194 3.4592 3.8116 1.1378 1.4177 2.3342 2.2875 2.7401 2.7540 3.1775 2.5270 2.1335 2.8204 2.3640 2.7332 2.8304 3.1097 2.9283 2.9968 3.1904 3.2220 5.1195 6.0200 2.8473 2.3263 2.5553 4.2569 3.1880 3.0910 1.9949 1.7088 1.3270 5.0418 1.8764 2.9049 1.9973 2.2611 2.0526 1.5928 2.0512 2.1801 2.1636 1.8065 1.6067 2.1574 1.3934 1.2268 1.3561 1.4144 1.9682 2.5732 2.4099 2.1742 2.3730 2.0975 2.8417 1.9921 2.9212 2.4869 2.5969 2.3718 2.2497 2.0704 2.3368 2.3810 1.4548 1.9093 1.1213 1.2497 1.0701 1.4269 1.3205 1.9170 1.7691 1.4678 1.3579 1.4983 1.3235 1.3747 1.2543 1.2231 1.3135 1.3522 1.4961 1.4072 1.2642 1.4417 1.3934 1.2757 1.2334 1.8254 1.3970 1.2042 3.0099 3.8194 2.4047 1.0866 1.0858 1.0966 2.2508 1.1101 1.0710 1.0880 1.0930 1.0463 1.0691 1.0534 1.0472 3.6110 7.2788 5.2433 6.3300 1.0712 1.0703 1.0691 1.0671 1.0796 1.0670 1.0632 1.0392 1.0382 1.0636 1.0843 1.0868 1.0961 1.0883 1.0900 1.0962 1.0969 1.0987 1.0992 1.0952 1.0975 1.0970 1.0855 1.0858 1.0907 1.0897 1.0970 1.0976 1.0971
irintensity: 0.1117 0.1022 0.2330 0.0147 0.0347 0.1587 0.1205 0.9492 0.6683 0.1927 1.3452 1.7259 0.1188 0.2055 1.7878 1.8065 0.1354 5.2927 1.7726 4.2617 6.4826 1.6600 0.5513 1.8694 1.0820 2.1879 17.5569 1.3142 0.1028 1.7485 0.2371 0.1883 3.8057 6.4686 10.4532 1.6723 0.0984 3.3112 25.7057 1.6876 4.4468 0.4131 66.1112 10.9007 66.5540 14.2746 0.5721 0.0682 3.6040 4.4163 6.9171 1.1450 1.5737 15.4822 4.0532 7.0734 2.3557 0.1503 6.6139 7.5967 21.4952 11.7178 6.8962 5.9119 8.8784 16.7200 8.1391 4.1819 28.7291 4.7091 7.2711 10.4633 18.4796 22.5073 1.7969 1.0230 2.8748 1.0204 1.5158 6.1218 6.1932 3.4804 6.7164 7.0305 4.3379 3.6037 4.8558 18.5626 0.2171 1.9278 2.8265 6.3279 1.4654 12.1208 15.4720 4.4588 4.4157 1.2811 11.2953 9.7083 7.6072 12.1362 2.0446 5.1745 3.2689 2.4708 1.7802 12.1783 0.9988 0.6065 4.7158 10.2325 14.9038 9.4392 7.9546 15.4785 12.4107 7.1981 6.2916 4.6182 0.4917 31.6687 67.6168 205.7098 28.2900 5.6082 103.6817 27.5050 40.8255 34.3178 34.2873 4.9644 7.1318 8.1255 30.5752 34.8610 70.6436 20.9455 67.2976 71.3587 38.0900 44.3906 43.4633 5.4676 0.2687 16.4441 20.0859 38.2586 33.9872 16.7549
temp: 298.150 k
press: 1.00000 atm
elementType: 8 7 6 6 6 6 6 6 6 6 6 6 6 6 6 6 6 6 6 6 6 6 6 1 1 1 1 1 1 1 1 1 1 1 1 1 1 1 1 1 1 1 1 1 1 1 1 1 1 1 1 1
symmnumber: 1
zpe: 1185492.8 jmol-1
zpe.correction: 0.451530 hartree
zpe.thermalcorrener: 0.474023 hartree
zpe.thermalcorrenthalpy: 0.474967 hartree
zpe.thermalcorrgfe: 0.397390 hartree
zpe.sumelectzpe: -945.847888 hartree
zpe.sumelectthermal: -945.825395 hartree
zpe.sumelectthermalent: -945.824451 hartree
zpe.sumelectthermalfe: -945.902028 hartree
dipole: -1.2171 -0.6525 1.0365
dipole: 1.7267
quadrupole: -152.9318 -129.5002 -137.4179
quadrupole: -4.0336 -2.4469 -1.7212
quadrupole: -12.9818 10.4498 2.5321 -4.0336 -2.4469 -1.7212
hfenergy: -946.2994185 hartree
pointgroup: C01 [X(C21H29N1O1)]
dipole: -0.430146 0.3437487 -0.397892 debye
polarizability: 237.7809072|11.6087524|262.053057|28.5804094|-26.5530261|201.2783417 unknown
InChI: InChI=1S/C21H29NO/c1-3-17(2)19(11-12-22-13-15-23-16-14-22)21-10-6-8-18-7-4-5-9-20(18)21/h4-10,17,19H,3,11-16H2,1-2H3
charge 0 multiplicity 1
52 atoms
O  4.843848 -1.015445 0.528966
N  2.417014 0.016488 -0.706144
C  -0.235765 1.526256 -0.218295
C  -0.961792 2.843753 0.238884
C  0.717381 1.746225 -1.430876
C  1.534816 0.490364 -1.804877
C  -1.245049 0.408274 -0.528239
C  -1.828762 2.572757 1.503055
C  0.040353 3.994575 0.502521
C  3.603054 0.884208 -0.488665
C  2.845942 -1.393354 -0.90177
C  -1.248826 -0.865411 0.1656
C  -2.210825 0.628047 -1.524263
C  4.412244 0.378518 0.71727
C  3.664682 -1.870808 0.307213
C  -2.796804 3.717803 1.873822
C  -2.269397 -1.85066 -0.16136
C  -3.201294 -0.344124 -1.854368
C  -0.28153 -1.217131 1.17102
C  -3.237356 -1.563072 -1.177409
C  -2.293588 -3.105585 0.535628
C  -0.329676 -2.447989 1.830081
C  -1.348568 -3.402178 1.517851
H  0.407539 1.217354 0.625852
H  -1.647382 3.164742 -0.575554
H  1.40719 2.581179 -1.211464
H  0.131864 2.051265 -2.321834
H  2.125196 0.700844 -2.733383
H  0.836021 -0.332112 -2.047183
H  -2.419431 1.651385 1.341794
H  -1.152732 2.363831 2.359109
H  -0.473193 4.870722 0.936396
H  0.540681 4.339635 -0.419399
H  0.82248 3.67524 1.219559
H  3.273097 1.920909 -0.290927
H  4.263463 0.901093 -1.393343
H  3.462113 -1.510069 -1.829048
H  1.945461 -2.027502 -1.003118
H  -2.215348 1.582575 -2.064006
H  5.340837 0.95933 0.845376
H  3.79262 0.457354 1.637625
H  3.022705 -1.865029 1.215074
H  4.064412 -2.885162 0.14323
H  -2.264467 4.64676 2.148492
H  -3.470876 3.952599 1.027727
H  -3.428514 3.433306 2.73555
H  -3.936245 -0.12257 -2.636329
H  0.530449 -0.521336 1.398837
H  -4.000636 -2.314257 -1.413359
H  -3.074217 -3.832034 0.278352
H  0.420877 -2.688247 2.591895
H  -1.378067 -4.362118 2.045334
