program: Gaussian 09
title: 000205703
version: EM64L-G09RevD.01
frameworkgroup: C1[X(C17H21NO)]
method: RPBEPBE
basis: SDD
operation: Freq
keyword: #p
keyword: freq=noraman
keyword: PBEPBE/SDD
title: #p freq=noraman PBEPBE/SDD
converged: YES YES NO NO
title: Mulliken charges:
elementType: O N C C C C C C C C C C C C C C C C C H H H H H H H H H H H H H H H H H H H H H
charge: -0.246650 -0.083792 -0.333313 -0.415020 -0.337845 -0.344618 -0.588382 -0.326716 -0.319745 0.427148 0.176471 -0.459302 0.393215 -0.388794 -0.460845 -0.244351 -0.436584 -0.269347 -0.244539 0.172727 0.206202 0.230009 0.230395 0.186125 0.214332 0.209359 0.189123 0.217830 0.206582 0.192990 0.214016 0.212767 0.192575 0.234863 0.238476 0.238290 0.225212 0.236997 0.226007 0.228133
chargesum: 0.00000
title: Mulliken charges with hydrogens summed into heavy atoms:
elementType: O N C C C C C C C C C C C C C C C C C
charge: -0.246650 -0.083792 0.045616 0.045383 0.062613 0.053864 -0.163971 0.080289 0.085597 0.427148 0.176471 -0.224440 0.393215 -0.150318 -0.222555 -0.019138 -0.199587 -0.043340 -0.016407
polarizability: 2.25730922e+02 1.35586979e+01 2.18974465e+02 2.83917017e+01 -1.24972435e+01 1.33780598e+02
1716.lowfreq: -5.5717 -0.0006 -0.0006 -0.0005 1.3797 9.0478 19.5987 22.6711 38.1387
frequency: 19.2189 22.2197 38.0682 68.0152 99.3854 122.6015 149.6204 178.3424 194.3153 218.6173 234.1277 281.3040 299.2381 313.7893 383.8610 403.6002 425.9742 431.1812 463.1570 470.6474 477.5435 497.8958 509.3739 561.4541 588.5614 610.2778 654.9132 702.8034 743.4433 757.3235 765.5744 785.7649 790.7445 809.1696 813.1337 840.4571 852.5129 869.1461 879.2388 901.2072 916.9833 959.5980 982.8380 991.4441 994.5804 1010.3957 1024.4370 1028.2505 1032.4628 1051.9657 1057.0184 1073.0257 1084.4788 1092.1623 1108.1237 1130.4735 1144.0182 1151.6891 1172.9658 1181.3568 1188.0447 1191.6538 1236.4325 1239.1274 1245.0844 1265.3824 1267.3988 1273.9878 1283.7481 1292.0836 1296.9874 1330.2348 1334.0781 1344.6339 1363.8079 1370.6936 1379.5391 1390.9590 1406.0357 1417.4450 1441.7333 1442.2152 1447.3494 1451.8019 1455.7101 1458.3181 1469.0281 1480.1125 1494.3461 1518.4451 1590.3300 1598.6714 1632.7369 2819.5711 2850.3117 2863.4325 2953.5672 2957.6654 2975.8856 2994.1319 3001.8500 3022.8624 3025.2014 3044.4599 3064.0813 3079.0534 3082.3162 3116.8344 3119.5532 3126.2677 3129.7378 3146.1070 3154.0878 3162.0952
redmass: 2.9762 4.9353 4.7528 3.9298 3.7845 2.0567 4.0674 4.0737 3.1828 3.8942 1.8141 3.1426 3.2588 2.3174 2.5503 2.4093 3.8059 3.1364 3.2735 3.1325 3.4070 5.9050 5.4994 3.8714 2.7108 2.5358 3.4669 4.1768 1.2629 1.2541 3.1055 4.2056 1.9820 3.7447 1.6188 1.5929 1.6147 2.6165 1.8926 2.3211 1.4494 1.3781 1.3604 1.3510 3.0392 2.9275 3.3207 2.2680 2.3031 2.5385 2.3508 2.5126 2.1793 2.8358 1.9023 2.2955 2.2987 1.4968 1.1301 1.2075 1.4550 1.1163 1.7908 1.2335 1.6481 1.3893 1.3444 1.4342 1.4068 1.1461 1.3575 1.2892 1.3642 1.2960 1.4035 1.2717 2.1306 1.4510 2.9789 5.2741 2.4285 1.0835 1.0809 1.0955 2.5556 1.0919 1.0867 1.1023 1.1211 3.5891 7.5963 5.3155 6.5532 1.0707 1.0705 1.0688 1.0664 1.0665 1.0601 1.0708 1.0750 1.0893 1.0994 1.0887 1.1037 1.0962 1.0979 1.0865 1.0860 1.0910 1.0879 1.0943 1.0992 1.1003
irintensity: 0.0291 0.1507 0.0754 0.4109 0.7554 0.5055 2.1598 1.4616 2.0113 0.4037 2.5777 5.8778 0.7278 13.3750 1.2355 1.7275 9.9758 1.8054 1.3415 1.0623 2.6957 1.0301 1.0533 4.4989 1.6586 10.0872 0.8060 0.8229 3.8017 5.6875 4.4174 7.6263 77.9010 20.5891 57.1799 0.0272 1.1248 2.9260 6.4677 10.9094 0.2184 1.8501 1.9386 0.9759 20.8229 7.9117 7.8909 9.5092 2.6946 26.8191 2.0569 5.9945 6.2195 35.5839 1.5593 56.9541 18.9680 4.2350 1.3634 0.7245 1.8164 1.8403 3.2692 19.6554 7.9506 12.8280 1.6215 0.8891 5.4429 1.8277 9.8318 9.7548 0.7204 11.2522 2.0832 4.4264 11.2784 8.0425 4.9917 4.0202 2.9902 3.0897 1.0914 19.2969 1.6860 4.7500 1.5437 1.6236 14.4775 10.2343 3.8096 8.5331 0.3645 71.5178 49.8778 148.4181 33.9417 100.7847 25.4003 6.0992 40.9342 53.4002 2.5338 38.6964 44.0506 43.2214 34.5854 6.0753 1.2178 18.7419 4.1270 40.9231 42.5716 24.6887
temp: 298.150 k
press: 1.00000 atm
elementType: 8 7 6 6 6 6 6 6 6 6 6 6 6 6 6 6 6 6 6 1 1 1 1 1 1 1 1 1 1 1 1 1 1 1 1 1 1 1 1 1
symmnumber: 1
zpe: 895424.7 jmol-1
zpe.correction: 0.341049 hartree
zpe.thermalcorrener: 0.357805 hartree
zpe.thermalcorrenthalpy: 0.358749 hartree
zpe.thermalcorrgfe: 0.294460 hartree
zpe.sumelectzpe: -788.957534 hartree
zpe.sumelectthermal: -788.940778 hartree
zpe.sumelectthermalent: -788.939834 hartree
zpe.sumelectthermalfe: -789.004123 hartree
dipole: 1.2359 -0.7604 -0.6754
dipole: 1.6006
quadrupole: -123.6600 -105.5857 -114.3639
quadrupole: 9.2023 9.3312 -0.6114
quadrupole: -9.1234 8.9508 0.1726 9.2023 9.3312 -0.6114
hfenergy: -789.2985828 hartree
pointgroup: C01[X(C17H21N1O1)]
dipole: -0.480987 -0.2970262 0.2774107 debye
polarizability: 226.1073462|-12.2195379|219.4051383|28.9430996|9.3432177|132.9735009 unknown
InChI: InChI=1S/C17H21NO/c1-2-9-17-15(5-1)6-3-7-16(17)8-4-10-18-11-13-19-14-12-18/h1-3,5-7,9H,4,8,10-14H2
charge 0 multiplicity 1
40 atoms
O  5.818068 1.032729 -0.68314
N  3.368882 -0.33055 0.113743
C  2.202414 -0.630447 0.979646
C  0.865765 -0.695811 0.21359
C  3.340554 1.042597 -0.455159
C  4.654029 -0.555057 0.827822
C  -0.286871 -1.205687 1.125505
C  4.544387 1.253875 -1.387991
C  5.837464 -0.330336 -0.126364
C  -1.643377 -1.187705 0.435436
C  -2.401741 0.037407 0.291382
C  -2.16452 -2.372532 -0.102581
C  -3.671864 0.008415 -0.411728
C  -1.952321 1.294598 0.822486
C  -4.155418 -1.229597 -0.949727
C  -3.414064 -2.400698 -0.795685
C  -4.425107 1.221309 -0.554591
C  -2.708136 2.45962 0.669592
C  -3.956585 2.425839 -0.027701
H  2.110324 0.111803 1.818098
H  2.388138 -1.617452 1.448971
H  0.981525 -1.372111 -0.653806
H  0.594069 0.298218 -0.188109
H  3.362213 1.817316 0.354572
H  2.411631 1.182612 -1.036543
H  4.67728 -1.59619 1.203169
H  4.76052 0.130798 1.707142
H  -0.053815 -2.240862 1.440461
H  -0.309452 -0.596966 2.051803
H  4.469274 0.557896 -2.251365
H  4.586292 2.293886 -1.751952
H  6.800271 -0.419483 0.403737
H  5.79402 -1.073006 -0.952154
H  -1.59602 -3.303825 0.010318
H  -1.00237 1.341016 1.365088
H  -5.115055 -1.240207 -1.480185
H  -3.784662 -3.34821 -1.202073
H  -5.383068 1.184949 -1.087561
H  -2.347045 3.406372 1.086647
H  -4.540831 3.345479 -0.142492
