program: Gaussian 09
title: 000205689
version: EM64L-G09RevD.01
frameworkgroup: C1[X(C13H9N3O2)]
method: RPBEPBE
basis: SDD
operation: Freq
keyword: #p
keyword: freq=noraman
keyword: PBEPBE/SDD
title: #p freq=noraman PBEPBE/SDD
converged: YES YES NO NO
title: Mulliken charges:
elementType: O O N N N C C C C C C C C C C C C C H H H H H H H H H
charge: -0.431753 -0.223157 -0.217306 0.009417 0.024964 -0.087976 0.275975 0.305227 0.140791 -0.053096 -0.071448 -0.465285 -0.356551 -0.347876 -0.314176 -0.223106 -0.229530 -0.233284 0.288064 0.288399 0.283665 0.276709 0.249181 0.234280 0.235363 0.236727 0.405781
chargesum: 0.00000
title: Mulliken charges with hydrogens summed into heavy atoms:
elementType: O O N N N C C C C C C C C C C C C C
charge: -0.025972 -0.223157 -0.217306 0.009417 0.024964 -0.087976 0.275975 0.305227 0.140791 -0.053096 0.216616 -0.176886 -0.072886 -0.071166 -0.064994 0.011174 0.005832 0.003443
polarizability: 2.99077129e+02 -1.38004330e+01 1.68795521e+02 2.44887822e+00 -6.12683578e+00 8.06857119e+01
1716.lowfreq: -5.2973 -1.6854 -0.0008 -0.0007 0.0003 9.9289 39.4797 69.1577 80.4665
frequency: 39.4588 69.1006 80.4502 92.6583 159.2429 175.5168 248.9272 253.9411 263.5688 305.5244 360.2826 377.8527 403.7257 433.3333 453.6505 495.0199 530.9804 535.6156 538.1160 557.1626 613.2916 618.8764 634.4191 663.7155 691.4315 705.1565 722.6769 750.4902 778.8401 804.6310 826.4147 858.0136 868.0678 906.6527 928.5482 930.5616 968.4994 980.8029 987.8607 991.1780 1000.6814 1030.7670 1066.1764 1086.5437 1139.2693 1166.3790 1176.9435 1190.7910 1199.6631 1240.2763 1259.5120 1303.6782 1318.2355 1326.6985 1374.9725 1397.6795 1409.1305 1440.7637 1468.8991 1485.2281 1502.1118 1568.7483 1577.2844 1596.8882 1602.0791 1609.5794 3111.0907 3134.7611 3147.1082 3164.9456 3165.7558 3183.1612 3189.2214 3220.0943 3449.4153
redmass: 6.7273 4.0289 5.7633 5.8502 7.8279 6.2724 7.0969 6.3232 5.1132 6.4738 6.5077 5.5693 2.8245 3.8874 8.1813 3.6880 1.6194 4.7277 4.0502 5.3751 6.3597 6.9472 9.0530 7.4017 7.1330 2.2486 3.8558 2.5164 3.4003 1.3637 5.5126 1.3133 5.7993 1.4381 1.3332 1.4053 6.5335 1.5946 3.3911 3.2271 1.3585 2.2821 4.8215 1.7883 5.9643 1.9430 1.0560 1.5757 1.1976 2.7606 2.9165 3.4210 1.4281 1.4254 5.8426 2.0823 2.6087 2.6069 3.6746 3.6191 6.0220 9.4057 5.6690 6.9244 8.7077 6.3871 1.0882 1.0873 1.0930 1.0990 1.0921 1.0906 1.0961 1.0986 1.0653
irintensity: 0.1023 0.6017 1.4190 0.9427 2.7545 0.7334 1.3868 0.6417 0.4673 2.3754 5.9169 5.8029 2.7055 9.2066 8.1030 24.5075 82.6448 14.3826 38.2325 3.3390 2.4968 4.2504 0.5683 5.7167 9.9296 29.4409 3.4037 20.9760 41.0097 50.4117 9.9285 7.0286 6.4802 4.8998 0.0215 1.3072 15.4614 6.1030 0.5684 4.0239 0.5157 3.4192 23.9956 16.7253 16.3263 73.0305 0.2385 87.3551 35.8041 4.5860 34.7510 69.9849 15.6153 2.1995 2.8977 41.2550 25.9040 12.2543 57.0366 49.2219 102.1293 208.7239 3.1474 11.0221 260.9209 2.0135 4.4876 0.2722 19.9896 30.3650 1.3661 8.3956 4.4343 2.6662 124.4084
temp: 298.150 k
press: 1.00000 atm
elementType: 8 8 7 7 7 6 6 6 6 6 6 6 6 6 6 6 6 6 1 1 1 1 1 1 1 1 1
symmnumber: 1
zpe: 513848.7 jmol-1
zpe.correction: 0.195715 hartree
zpe.thermalcorrener: 0.209336 hartree
zpe.thermalcorrenthalpy: 0.210280 hartree
zpe.thermalcorrgfe: 0.154880 hartree
zpe.sumelectzpe: -814.225679 hartree
zpe.sumelectthermal: -814.212058 hartree
zpe.sumelectthermalent: -814.211114 hartree
zpe.sumelectthermalfe: -814.266514 hartree
dipole: -2.1578 -6.8626 -1.0684
dipole: 7.2727
quadrupole: -96.6091 -111.1841 -102.9946
quadrupole: -0.3404 0.5760 -4.4450
quadrupole: 6.9868 -7.5882 0.6013 -0.3404 0.5760 -4.4450
hfenergy: -814.421394 hartree
pointgroup: C01 [X(C13H9N3O2)]
dipole: 0.8840325 -2.6325834 -0.6892338 debye
polarizability: 298.4514291|11.8630512|149.9798409|12.1032377|37.0818801|100.1270915 unknown
InChI: InChI=1S/C13H9N3O2/c17-12-11(9-4-2-1-3-5-9)13(18)16-7-6-14-8-10(16)15-12/h1-8,18H
charge 0 multiplicity 1
27 atoms
O  -0.073889 -2.06922 -0.409671
O  0.668462 2.529136 1.030233
N  -1.809302 -0.566275 -0.097924
N  -1.488597 1.768403 0.538688
N  -4.596259 -0.064917 -0.111505
C  0.463571 0.274382 0.164626
C  -0.418248 -0.757698 -0.120001
C  1.928383 0.033703 0.086534
C  -2.28186 0.756545 0.217412
C  -0.079468 1.597962 0.610797
C  -2.7142 -1.600118 -0.377279
C  2.490855 -0.665187 -1.024877
C  2.798814 0.491877 1.114036
C  -3.730078 0.909787 0.164217
C  -4.068267 -1.333815 -0.374505
C  3.878144 -0.923475 -1.088634
C  4.182925 0.226913 1.045735
C  4.728223 -0.487519 -0.046822
H  -2.280587 -2.577105 -0.588115
H  1.85961 -0.927221 -1.884285
H  2.384473 1.065188 1.946227
H  -4.113075 1.912133 0.377848
H  -4.789127 -2.125747 -0.587031
H  4.293856 -1.445863 -1.957299
H  4.839538 0.586802 1.845201
H  5.804358 -0.686202 -0.094158
H  0.916046 -2.17277 -0.355646
