program: Gaussian 09
title: 000205687
version: EM64L-G09RevD.01
frameworkgroup: C1[X(C14H21N3O4)]
method: RPBEPBE
basis: SDD
operation: Freq
keyword: #p
keyword: freq=noraman
keyword: PBEPBE/SDD
title: #p freq=noraman PBEPBE/SDD
converged: YES YES NO NO
title: Mulliken charges:
elementType: O O O O N N N C C C C C C C C C C C C C C H H H H H H H H H H H H H H H H H H H H H
charge: -0.294713 -0.295931 -0.304131 -0.310281 -0.220621 -0.434266 -0.509620 -0.073257 -0.456981 -0.506061 -0.463372 0.287740 0.601339 -0.547430 -0.693990 0.302965 0.334848 0.009952 -0.525243 -0.527350 -0.523878 0.269351 0.219635 0.238683 0.251154 0.225883 0.227617 0.229117 0.246181 0.266702 0.291182 0.329907 0.242317 0.226211 0.264920 0.212034 0.250249 0.227874 0.222266 0.255677 0.223726 0.229594
chargesum: 0.00000
title: Mulliken charges with hydrogens summed into heavy atoms:
elementType: O O O O N N N C C C C C C C C C C C C C C
charge: -0.294713 -0.295931 -0.304131 -0.310281 0.025560 -0.167565 -0.218438 0.196093 0.001337 -0.029024 -0.006638 0.287740 0.601339 -0.217523 -0.451672 0.302965 0.334848 0.009952 0.177921 0.173039 0.185119
polarizability: 2.92085978e+02 -8.49696603e-01 1.89073502e+02 4.05630612e+00 -2.01496943e-01 1.23686233e+02
1716.lowfreq: -27.0480 -7.8557 -1.7698 -0.0006 0.0002 0.0006 7.0821 27.3443 29.4904
frequency: -24.9836 27.1709 29.3523 47.7012 61.2905 64.1430 76.0868 81.7196 90.5082 96.4027 140.5864 150.3313 155.7052 164.3791 183.4825 194.4385 224.5060 229.9541 255.3394 258.0117 286.7402 301.0389 326.7452 346.9094 367.7723 388.0255 437.8152 454.9953 479.0745 514.5275 576.1934 581.7281 599.3899 635.5558 641.7718 650.6040 685.6685 699.4647 706.9005 732.7181 764.0420 771.6470 822.1149 850.1455 861.0602 872.2504 897.7947 912.1201 918.7375 925.3387 935.7179 942.3947 968.2299 999.9625 1029.6794 1041.6838 1071.5803 1076.6329 1094.5358 1111.1658 1113.3112 1115.0389 1133.5496 1150.6630 1157.8837 1160.0210 1181.1075 1190.2335 1198.1567 1201.4221 1208.0355 1225.7264 1280.2358 1292.8228 1303.2044 1319.0731 1335.2784 1339.5485 1360.7382 1395.8846 1413.9951 1418.7180 1429.5238 1437.2587 1454.2593 1456.8048 1457.9089 1459.5272 1467.1121 1471.2512 1477.4764 1479.4039 1481.3121 1483.6884 1487.1090 1509.0625 1582.8456 1616.1831 1642.3920 2971.0410 2972.7644 2975.8663 2996.0292 2998.6040 3013.1379 3063.1230 3068.6899 3076.3906 3076.4094 3080.8165 3086.5990 3091.1661 3118.2158 3119.0211 3125.1362 3137.6125 3204.8092 3407.4349 3523.4567 3532.7048
redmass: 3.7839 3.1344 3.4779 5.2731 3.2326 4.0204 3.1343 3.0551 2.9503 3.1560 1.8800 1.3789 1.4474 1.1344 3.1229 3.9713 3.9568 3.7782 4.5670 2.3297 4.9558 7.3375 4.7476 1.3994 4.6292 3.4165 3.6881 3.0304 5.9641 5.2398 1.9717 2.9932 3.1037 3.7976 2.6442 3.5336 2.5000 8.7166 2.5078 4.0817 3.8172 3.5504 1.8717 1.9248 3.1376 5.6143 2.6186 2.8557 1.9584 2.5592 4.0530 4.5030 2.1759 4.1762 2.6337 4.0900 2.1451 2.2368 3.3013 1.2399 1.2395 1.2392 2.6450 1.3655 1.5000 1.4713 1.9695 1.2521 1.6181 1.4291 1.4801 1.8392 1.4097 1.3011 1.2446 3.4209 1.2920 1.5004 4.6779 3.3939 1.1398 1.2235 1.2849 1.2812 1.0954 1.0899 1.0579 1.0745 1.1045 2.3781 1.1147 1.0914 1.7105 1.0611 1.0711 2.4612 5.4739 6.8133 4.4315 1.0311 1.0338 1.0298 1.0652 1.0637 1.0634 1.0983 1.1036 1.1045 1.0922 1.0979 1.1012 1.1008 1.1034 1.1027 1.1046 1.0918 1.0927 1.0754 1.0769 1.0758
irintensity: 0.0778 0.1381 0.3364 13.2547 1.9502 1.8885 2.2849 2.6297 3.0813 9.7265 2.1593 1.9185 2.7079 0.6319 3.0285 4.9378 14.7606 0.1940 7.0058 5.6179 13.9104 18.8093 1.9249 15.6350 4.3341 11.8199 2.4692 7.4841 2.1119 0.2990 78.0272 47.3875 52.2641 10.4584 1.0646 7.0407 65.1682 6.7649 131.9247 39.9740 14.4503 2.3702 9.3226 27.6069 3.4581 12.1338 2.7941 11.5655 73.5634 5.6402 41.8358 28.7618 8.7108 49.0051 84.8902 130.9360 0.1586 4.3485 27.1278 13.2366 8.6012 4.0419 21.3440 3.0506 9.5054 16.6198 17.4001 80.5213 123.3613 238.8074 10.2422 167.3487 2.5434 40.5223 6.0183 104.6925 4.9197 69.0132 92.2244 60.3219 13.5370 7.5369 33.2008 21.8602 35.6534 14.5326 18.5423 17.1830 25.4695 309.5501 24.1685 3.4829 229.7508 34.0552 11.1506 483.8627 179.7513 191.0491 162.9509 63.9634 115.0226 58.5398 41.7403 63.9247 29.3327 9.7355 27.0308 23.9555 8.3050 35.0402 28.4128 46.3804 27.1372 25.7435 15.9842 7.7492 17.4081 6.3503 11.3403 14.7798
temp: 298.150 k
press: 1.00000 atm
elementType: 8 8 8 8 7 7 7 6 6 6 6 6 6 6 6 6 6 6 6 6 6 1 1 1 1 1 1 1 1 1 1 1 1 1 1 1 1 1 1 1 1 1
symmnumber: 1
zpe: 899223.2 jmol-1
zpe.correction: 0.342496 hartree
zpe.thermalcorrener: 0.364311 hartree
zpe.thermalcorrenthalpy: 0.365255 hartree
zpe.thermalcorrgfe: 0.289952 hartree
zpe.sumelectzpe: -1009.574074 hartree
zpe.sumelectthermal: -1009.552259 hartree
zpe.sumelectthermalent: -1009.551315 hartree
zpe.sumelectthermalfe: -1009.626618 hartree
dipole: 0.2655 3.1451 -2.0542
dipole: 3.7659
quadrupole: -111.2886 -121.8292 -124.0143
quadrupole: -9.4929 6.1235 -1.1201
quadrupole: 7.7554 -2.7852 -4.9703 -9.4929 6.1235 -1.1201
hfenergy: -1009.9165696 hartree
pointgroup: C01 [X(C14H21N3O4)]
dipole: -0.1181215 -1.1354803 -0.9443927 debye
polarizability: 292.0875983|-2.326634|188.2327859|-2.7495104|7.6313139|124.5253286 unknown
InChI: InChI=1S/C14H21N3O4/c1-19-11-6-10(7-12(20-2)13(11)21-3)17-14(18)16-9-4-5-15-8-9/h6-7,9,15-17H,4-5,8H2,1-3H3
charge 0 multiplicity 1
42 atoms
O  1.887398 1.467767 0.146064
O  -3.470869 -2.528736 -0.297197
O  -2.854127 2.354026 0.262599
O  -4.652292 0.112186 0.034278
N  6.399353 -1.076416 0.663727
N  3.29512 -0.387444 -0.081774
N  0.974028 -0.6978 -0.120069
C  4.538864 0.393285 0.034454
C  5.474375 0.223161 -1.214147
C  5.439414 -0.086684 1.224416
C  6.749664 -0.520911 -0.677425
C  2.03721 0.21799 -0.006362
C  -0.420726 -0.424059 -0.103837
C  -0.957311 0.880465 0.041356
C  -1.293637 -1.531618 -0.262063
C  -2.692693 -1.35692 -0.234732
C  -2.355717 1.046136 0.052019
C  -3.246196 -0.059194 -0.052145
C  -4.572982 -2.54834 -1.284354
C  -3.669724 2.895689 -0.848002
C  -5.1151 0.469696 1.399094
H  4.208467 1.43571 0.169776
H  4.954395 -0.35996 -1.995332
H  5.727942 1.203232 -1.653844
H  4.854033 -0.509667 2.057104
H  6.015856 0.776588 1.60873
H  7.579155 0.199235 -0.548247
H  7.10113 -1.321943 -1.349901
H  5.975004 -2.013836 0.586632
H  3.377894 -1.396448 -0.221589
H  1.213745 -1.685255 -0.228297
H  -0.303438 1.746645 0.146305
H  -0.911368 -2.550181 -0.394897
H  -5.052705 -3.530793 -1.155796
H  -5.28842 -1.732892 -1.089846
H  -4.165358 -2.46055 -2.310281
H  -4.540662 2.247071 -1.051071
H  -3.998375 3.890278 -0.50962
H  -3.049345 2.995509 -1.759038
H  -4.647481 1.415909 1.725129
H  -6.207191 0.585865 1.32009
H  -4.868528 -0.341992 2.108391
