program: Gaussian 09
title: 000213631
version: EM64L-G09RevD.01
frameworkgroup: C1[X(C22H24ClN3O)]
method: RPBEPBE
basis: SDD
operation: Freq
keyword: #p
keyword: freq=noraman
keyword: PBEPBE/SDD
title: #p freq=noraman PBEPBE/SDD
converged: NO YES NO NO
title: Mulliken charges:
elementType: Cl O N N N C C C C C C C C C C C C C C C C C C C C C C H H H H H H H H H H H H H H H H H H H H H H H H
charge: -0.081517 -0.293486 -0.061888 -0.402036 -0.407394 -0.057633 -0.474533 -0.424310 -0.370722 -0.387470 -0.346772 -0.571915 0.410859 0.108071 0.190695 -0.449693 0.224757 0.315245 -0.410393 -0.353651 -0.260474 -0.218324 -0.258553 -0.322801 -0.226749 -0.234414 -0.217125 0.268708 0.217762 0.211135 0.238529 0.209973 0.164997 0.217854 0.216528 0.187630 0.196318 0.221077 0.210543 0.223165 0.305390 0.269686 0.303131 0.229282 0.225586 0.218709 0.220224 0.289492 0.258128 0.238696 0.239684
chargesum: 0.00000
title: Mulliken charges with hydrogens summed into heavy atoms:
elementType: Cl O N N N C C C C C C C C C C C C C C C C C C C C C C
charge: -0.081517 -0.293486 -0.061888 -0.096646 -0.104262 0.211074 -0.045636 0.024192 0.012129 0.016689 0.070622 -0.138207 0.410859 0.108071 0.190695 -0.180008 0.224757 0.315245 -0.181112 -0.128065 -0.041765 0.001900 -0.258553 -0.033309 0.031378 0.004282 0.022559
polarizability: 3.45871830e+02 -1.51595479e+00 3.01852469e+02 -5.08477064e+00 1.35915900e+01 1.60973315e+02
1716.lowfreq: -4.1666 -0.0020 -0.0018 0.0008 0.7639 7.7924 11.0716 13.2728 16.0349
frequency: 11.0143 13.1470 15.6084 28.5702 41.3772 54.1369 63.5277 90.1818 111.9080 120.0846 129.6601 169.7472 199.6276 218.0037 220.6925 225.7356 241.2105 251.1609 271.7840 308.7796 320.4588 344.0269 386.4493 391.4171 406.1985 421.8082 423.8102 437.9319 456.4329 474.8341 481.1309 499.5021 513.1281 515.3510 539.8695 575.9445 584.1358 588.8649 630.0593 633.2475 664.5296 680.2185 690.9053 723.7857 744.7524 746.7572 747.3823 758.1649 778.2248 779.3256 786.3103 800.8250 807.5615 817.9137 848.2177 867.5016 881.3696 882.1514 909.1603 929.2150 957.3884 968.1880 969.0540 988.0921 1001.5349 1004.2220 1006.5302 1010.5990 1016.7874 1035.9680 1039.9651 1057.6518 1068.9290 1090.2190 1096.0901 1105.4777 1112.9226 1132.2320 1133.2861 1137.2036 1151.8198 1165.5059 1171.2505 1175.9975 1187.0648 1225.0926 1238.1062 1243.5960 1252.4881 1260.9311 1265.1561 1285.0691 1288.8051 1294.1760 1303.8706 1308.9635 1334.9805 1337.5269 1348.1463 1352.6139 1363.2144 1367.0591 1367.8580 1390.4013 1394.2829 1416.2835 1420.6607 1445.6377 1449.2919 1457.3503 1459.1591 1461.5747 1472.0892 1473.1116 1481.6785 1483.8898 1502.1549 1555.6139 1564.2879 1586.7132 1587.1754 1603.6400 1631.5477 2787.1857 2838.6355 2860.4098 2981.2635 2998.3460 3001.1355 3023.3431 3028.8171 3034.3077 3041.2059 3052.8705 3063.2864 3072.7630 3121.1983 3128.6957 3140.3301 3142.8676 3152.9701 3161.0694 3165.1985 3177.2494 3219.3828 3505.9941 3614.4166
redmass: 8.0372 7.1979 5.1178 5.0104 6.7849 4.7759 3.4874 4.4933 3.5435 5.8100 4.0941 3.5209 3.7574 3.5740 3.1028 4.8279 3.3879 4.5944 3.4986 5.8476 5.0309 2.3683 2.2684 3.4663 3.8674 4.8251 2.8336 3.4520 3.4600 3.6381 4.3523 1.2444 4.6453 3.0199 5.5680 3.1011 3.1277 1.3695 6.3237 3.3070 3.2578 3.2064 6.6232 3.9913 2.5454 1.5033 2.6549 3.5941 2.0285 1.9841 1.3949 1.6430 1.8914 3.5989 1.4977 5.1219 2.1319 1.8373 2.4917 1.3817 2.5389 1.2978 1.3677 2.5403 4.5512 1.3504 1.8730 2.0253 1.9714 3.0451 2.7014 2.0845 3.0248 1.7389 1.4857 2.3454 1.8148 1.6912 2.0220 2.5820 2.4460 1.1288 1.0577 1.2078 1.1777 1.6625 2.1928 1.5703 1.4765 1.4320 1.7317 1.5138 1.2648 1.4733 1.8362 1.4978 1.4917 1.3532 1.7902 1.4874 1.5598 2.4436 1.7737 4.9125 1.4578 2.3164 2.3495 1.1027 2.2650 1.0895 2.9878 1.2160 1.1123 1.1016 2.9733 1.1357 1.7026 6.4539 6.2767 6.2039 7.3083 6.6729 6.8868 1.0716 1.0708 1.0701 1.0622 1.0620 1.0630 1.0873 1.0849 1.0862 1.0868 1.0996 1.1014 1.1015 1.0847 1.0889 1.0860 1.0952 1.0902 1.1001 1.0952 1.1003 1.0983 1.0786 1.0809
irintensity: 0.1608 0.2298 1.8154 0.4208 3.7540 4.0486 0.1810 1.5593 0.0265 0.9175 1.3628 1.4002 1.2324 8.3852 1.3360 2.6622 4.0141 1.8200 5.5383 2.8344 3.8470 2.5889 2.7176 7.3288 10.5807 4.0335 14.5807 1.5322 3.3404 8.7863 4.9335 90.3138 3.6013 5.0910 0.3988 8.1946 4.5565 82.8157 7.3113 0.6687 4.8648 7.0508 15.8297 2.4708 44.2069 93.1125 23.4081 7.4960 49.8197 6.0860 3.5121 7.7459 9.8543 0.9548 0.2339 1.3188 4.5463 3.9327 8.7712 2.3773 3.4932 0.0720 2.6374 28.3712 47.5058 2.0829 4.6321 7.9753 12.8015 4.0744 11.4941 8.3368 4.9004 28.6595 28.8836 31.6442 0.8434 20.2986 11.6208 3.8840 35.4730 1.0920 3.3959 2.0316 10.4415 10.2857 12.5054 11.8799 15.0116 2.3170 53.3048 7.9344 1.7361 19.5732 10.2571 9.5835 17.1191 11.2536 22.7658 7.5723 1.1188 6.9914 10.7004 33.2296 3.8505 13.9557 2.6281 25.8773 54.6834 16.7431 13.1353 8.6134 26.8076 22.1677 2.4046 30.6267 332.0767 30.1863 2.2854 1.6756 157.6452 25.3398 2.3501 97.7531 75.3114 114.7178 31.9272 24.2524 16.7233 6.0481 43.5453 42.5663 42.3773 37.0301 27.8905 33.7821 3.3918 4.6614 4.3683 45.8426 2.6083 27.9674 9.7726 18.4617 1.3018 55.1139 62.5210
temp: 298.150 k
press: 1.00000 atm
elementType: 17 8 7 7 7 6 6 6 6 6 6 6 6 6 6 6 6 6 6 6 6 6 6 6 6 6 6 1 1 1 1 1 1 1 1 1 1 1 1 1 1 1 1 1 1 1 1 1 1 1 1
symmnumber: 1
zpe: 1092345.8 jmol-1
zpe.correction: 0.416053 hartree
zpe.thermalcorrener: 0.440084 hartree
zpe.thermalcorrenthalpy: 0.441028 hartree
zpe.thermalcorrgfe: 0.357967 hartree
zpe.sumelectzpe: -1550.342892 hartree
zpe.sumelectthermal: -1550.318861 hartree
zpe.sumelectthermalent: -1550.317917 hartree
zpe.sumelectthermalfe: -1550.400978 hartree
dipole: 1.8478 1.4840 -0.1674
dipole: 2.3758
quadrupole: -137.4296 -160.3721 -167.1663
quadrupole: -25.2937 -13.7769 0.0801
quadrupole: 17.5597 -5.3828 -12.1770 -25.2937 -13.7769 0.0801
hfenergy: -1550.7589449 hartree
pointgroup: C01 [X(C22H24Cl1N3O1)]
dipole: -0.7475871 -0.5330141 -0.1752131 debye
polarizability: 343.7802285|-4.3309467|303.5133456|18.5007513|-0.9700878|161.4040396 unknown
InChI: InChI=1S/C22H24ClN3O/c23-20-7-3-1-6-19(20)22(27)25-17-10-13-26(14-11-17)12-9-16-15-24-21-8-4-2-5-18(16)21/h1-8,15,17,24-25H,9-14H2
charge 0 multiplicity 1
51 atoms
Cl 2.290107 -2.2275 0.320348
O  4.808083 1.716392 0.160924
N  -0.647866 1.86861 0.213065
N  2.824991 0.777143 0.890206
N  -6.399094 0.929915 -1.283449
C  2.179517 2.097073 1.090395
C  1.004297 1.962865 2.083393
C  1.665426 2.689384 -0.248851
C  -0.199989 1.217437 1.467559
C  0.453972 1.905744 -0.787651
C  -1.882601 1.259574 -0.342314
C  -3.152946 1.611373 0.47842
C  -4.41403 1.066009 -0.14655
C  -4.847255 -0.323579 -0.170711
C  4.111854 0.678265 0.419072
C  -5.386322 1.79326 -0.833207
C  -6.095179 -0.378085 -0.889615
C  4.735109 -0.704009 0.250831
C  -4.307764 -1.528344 0.35562
C  -6.800317 -1.584966 -1.094232
C  -5.006614 -2.734781 0.157729
C  -6.239043 -2.763198 -0.56139
C  4.121068 -1.980985 0.197286
C  6.153189 -0.687449 0.105851
C  4.851076 -3.173799 0.019284
C  6.907243 -1.861774 -0.06606
C  6.25509 -3.115375 -0.107783
H  2.957267 2.768775 1.49704
H  0.675466 2.980417 2.362357
H  1.335353 1.449257 3.006353
H  2.486711 2.692103 -0.987092
H  1.363871 3.738905 -0.069406
H  0.059733 0.136316 1.287552
H  -1.031771 1.220831 2.193584
H  0.073062 2.395113 -1.702711
H  0.777007 0.870943 -1.076141
H  -1.791808 0.14692 -0.433242
H  -2.020053 1.649952 -1.36802
H  -3.053294 1.217694 1.509351
H  -3.204546 2.712433 0.562485
H  2.27731 -0.068911 1.063177
H  -5.432918 2.863247 -1.029436
H  -7.227009 1.212864 -1.802117
H  -3.36268 -1.519965 0.910913
H  -7.748206 -1.612573 -1.643698
H  -4.602239 -3.670682 0.559334
H  -6.758354 -3.718055 -0.700609
H  6.622973 0.301531 0.122928
H  4.324336 -4.131313 -0.021591
H  7.995285 -1.801014 -0.169621
H  6.824001 -4.040984 -0.243855
