program: Gaussian 09
title: 000205686
version: EM64L-G09RevD.01
frameworkgroup: C1[X(C11H21N3O)]
method: RPBEPBE
basis: SDD
operation: Freq
keyword: #p
keyword: freq=noraman
keyword: PBEPBE/SDD
title: #p freq=noraman PBEPBE/SDD
converged: NO YES NO NO
title: Mulliken charges:
elementType: O N N N C C C C C C C C C C C H H H H H H H H H H H H H H H H H H H H H
charge: -0.308545 -0.093836 -0.406337 -0.654923 0.054002 -0.468631 -0.053085 -0.426006 -0.447034 -0.413666 -0.527053 -0.397112 -0.406342 -0.383911 0.265848 0.137327 0.212237 0.258899 0.262272 0.208740 0.227548 0.210513 0.192296 0.210762 0.210755 0.237475 0.220168 0.200168 0.185212 0.181670 0.202158 0.196540 0.193773 0.282459 0.297771 0.337888
chargesum: 0.00000
title: Mulliken charges with hydrogens summed into heavy atoms:
elementType: O N N N C C C C C C C C C C C
charge: -0.308545 -0.093836 -0.123877 -0.019264 0.191329 0.002505 0.209186 -0.023196 -0.025517 0.022622 -0.069411 -0.011732 -0.022514 0.006402 0.265848
polarizability: 1.50281527e+02 1.44124200e+00 1.44922372e+02 -8.59479485e+00 2.22181858e+00 1.16040704e+02
1716.lowfreq: -23.7577 -14.9250 -9.3767 -0.0006 -0.0006 0.0002 7.6091 21.2431 39.9377
frequency: -18.1905 18.2333 39.6834 49.4400 88.3122 128.1375 183.3949 207.7412 223.0848 234.9366 281.3796 322.9170 332.4913 379.4679 393.8124 430.7986 432.8234 446.0857 452.4763 478.4728 504.5773 508.9073 594.2135 664.7364 710.7843 732.0730 765.0849 785.0551 801.1871 834.2140 854.7475 860.3131 886.0710 892.6694 896.8508 920.6141 926.8510 952.0207 978.7319 1020.2193 1027.6709 1032.7223 1051.6653 1057.9241 1066.3921 1081.2662 1100.5789 1113.9459 1124.5780 1146.3363 1180.0444 1188.9881 1202.3473 1231.5934 1241.2221 1253.0207 1260.2093 1266.6438 1284.3202 1293.9846 1299.7812 1310.7410 1316.6777 1322.7877 1330.4802 1337.8233 1340.5715 1342.5882 1364.1983 1365.6767 1460.2379 1462.4683 1463.4695 1464.8023 1468.3241 1470.9993 1477.9462 1481.9242 1492.4911 1597.5723 1644.5130 2775.1657 2959.5759 2960.7519 2969.8615 2976.2990 2978.9307 2983.3392 2990.4107 3007.9447 3026.3977 3028.3241 3035.8931 3041.7914 3048.8831 3053.6790 3071.8043 3086.2365 3123.8117 3535.1572 3544.3962 3700.5164
redmass: 3.4063 3.9999 3.5576 3.2281 4.0521 2.5794 4.1061 2.6338 1.7470 1.2347 2.5082 2.2134 3.4384 3.1093 2.7780 2.4315 2.8077 1.8680 1.5147 2.0340 1.2293 1.4704 4.2515 2.6803 7.4056 3.8406 2.5730 1.4478 2.0155 3.0326 1.8090 2.5635 2.0479 1.5722 2.8637 1.9853 2.1521 2.4836 2.3732 2.3375 1.8827 2.5160 1.3459 1.5337 2.3066 1.6396 1.9963 2.3847 1.6838 2.3153 1.5589 1.2549 1.4887 1.6141 1.3935 1.2727 1.2347 1.3679 1.2507 1.4594 1.2589 1.3156 1.4251 1.4261 1.4545 1.4503 1.4670 1.5052 1.5247 1.4538 1.0954 1.0891 1.0867 1.1029 1.1124 1.0842 1.1475 1.0907 1.9364 1.3861 3.2548 1.0786 1.0643 1.0640 1.0620 1.0611 1.0711 1.0614 1.0673 1.0636 1.0961 1.0946 1.1013 1.1024 1.1025 1.0898 1.0950 1.1012 1.0930 1.0693 1.0533 1.1038
irintensity: 1.3165 7.9939 8.6573 1.5211 6.1292 0.4192 10.9572 2.3858 0.5229 4.5478 0.6890 1.1633 0.6159 16.6453 3.8988 25.9104 6.3396 145.5950 260.3506 13.5178 1.4816 2.9418 3.5862 1.9141 7.9423 28.7573 1.9365 0.3338 1.4978 2.6640 14.9333 9.9778 5.9224 10.2298 1.9968 0.8361 7.3921 11.5986 6.9447 10.8222 16.8126 26.4001 0.8893 4.4243 6.3094 2.6579 18.0239 0.7593 9.0177 1.9108 2.0265 8.1060 1.3569 14.1133 2.8502 5.1667 2.0763 2.9662 6.9132 49.6112 16.2128 5.5728 13.3131 16.1298 0.0769 0.5996 1.3331 8.0267 55.7092 12.5577 5.7475 5.5031 11.8381 11.3282 34.8890 6.9342 73.8492 2.7857 351.4689 109.6638 280.2048 101.3775 31.1680 43.3851 35.9207 9.3199 51.6513 17.8142 72.5221 33.0581 77.7561 70.8127 24.9985 10.9723 109.5320 6.8296 28.4677 48.6987 13.9129 27.3179 15.7421 34.2671
temp: 298.150 k
press: 1.00000 atm
elementType: 8 7 7 7 6 6 6 6 6 6 6 6 6 6 6 1 1 1 1 1 1 1 1 1 1 1 1 1 1 1 1 1 1 1 1 1
symmnumber: 1
zpe: 832208.0 jmol-1
zpe.correction: 0.316971 hartree
zpe.thermalcorrener: 0.331538 hartree
zpe.thermalcorrenthalpy: 0.332482 hartree
zpe.thermalcorrgfe: 0.274277 hartree
zpe.sumelectzpe: -670.055525 hartree
zpe.sumelectthermal: -670.040959 hartree
zpe.sumelectthermalent: -670.040014 hartree
zpe.sumelectthermalfe: -670.098220 hartree
dipole: 2.3928 -0.9094 -3.8980
dipole: 4.6634
quadrupole: -107.1516 -83.4213 -91.3471
quadrupole: -0.2894 8.0091 3.7551
quadrupole: -13.1783 10.5521 2.6262 -0.2894 8.0091 3.7551
hfenergy: -670.3724968 hartree
pointgroup: C01 [X(C11H21N3O1)]
dipole: -0.8341947 0.4973618 1.5565866 debye
polarizability: 148.8563106|-6.9017503|136.3383074|-8.6634754|-12.9215063|126.049985 unknown
InChI: InChI=1S/C11H21N3O/c12-11(15)13-9-6-7-14(8-9)10-4-2-1-3-5-10/h9-10,13H,1-8,12H2
charge 0 multiplicity 1
36 atoms
O  3.514119 -1.397376 -0.429978
N  -0.596101 0.940203 -1.230219
N  1.965881 0.059641 0.547361
N  2.862489 -1.735754 1.786415
C  -1.379825 0.34713 -0.095509
C  0.682583 0.289909 -1.62897
C  1.795265 0.857335 -0.682578
C  -2.821415 0.92322 -0.124791
C  -1.44577 -1.198218 -0.156485
C  -0.168208 2.351919 -0.988676
C  1.275046 2.293808 -0.361236
C  -3.700155 0.36322 1.017567
C  -2.333315 -1.778328 0.972845
C  -3.75832 -1.18055 0.962515
C  2.818662 -1.041086 0.572184
H  -0.931387 0.621049 0.901037
H  0.912284 0.60703 -2.666485
H  0.633412 -0.80695 -1.620364
H  2.772901 0.857676 -1.193223
H  -0.886785 2.883158 -0.343593
H  -0.129891 2.883847 -1.958632
H  -3.261242 0.661671 -1.107421
H  -2.794591 2.028488 -0.073652
H  -0.434286 -1.637485 -0.074072
H  -1.852535 -1.491153 -1.145732
H  1.93416 3.061739 -0.800727
H  1.258808 2.470984 0.729919
H  -4.718685 0.792096 0.952149
H  -3.283354 0.678551 1.997527
H  -1.859558 -1.566355 1.9549
H  -2.37646 -2.880357 0.87494
H  -4.346956 -1.577868 1.812195
H  -4.279484 -1.492312 0.034079
H  1.337662 0.24694 1.330519
H  2.400301 -1.422571 2.637125
H  3.483851 -2.539153 1.827266
