program: Gaussian 09
title: 000205685
version: EM64L-G09RevD.01
frameworkgroup: C1[X(C12H17N3O2)]
method: RPBEPBE
basis: SDD
operation: Freq
keyword: #p
keyword: freq=noraman
keyword: PBEPBE/SDD
title: #p freq=noraman PBEPBE/SDD
converged: YES YES NO NO
title: Mulliken charges:
elementType: O O N N N C C C C C C C C C C C C H H H H H H H H H H H H H H H H H
charge: -0.301226 -0.266387 -0.220248 -0.439024 -0.495749 -0.064199 -0.455531 -0.510495 -0.465247 0.284523 0.481637 -0.464471 -0.320317 -0.328944 -0.352471 0.320348 -0.538090 0.270131 0.239100 0.216474 0.226397 0.249188 0.230067 0.226629 0.245716 0.265606 0.281630 0.210031 0.309825 0.238281 0.248364 0.217104 0.243979 0.217371
chargesum: 0.00000
title: Mulliken charges with hydrogens summed into heavy atoms:
elementType: O O N N N C C C C C C C C C C C C
charge: -0.301226 -0.266387 0.025468 -0.173418 -0.214119 0.205932 0.000042 -0.034910 -0.008551 0.284523 0.481637 -0.254440 -0.010492 -0.090663 -0.104107 0.320348 0.140364
polarizability: 2.65281376e+02 -1.54678390e+00 1.43731744e+02 -1.77485760e+00 -2.00145274e+00 9.50180408e+01
1716.lowfreq: -9.5159 -7.6569 -3.9086 -0.0005 0.0004 0.0005 25.4859 32.0570 33.6822
frequency: 22.5340 30.3996 33.0547 54.4966 66.9652 79.5484 100.3716 160.5839 188.4113 192.0837 234.1317 257.4128 267.0460 326.3523 349.0902 373.8781 382.0867 414.1379 448.5173 461.6156 522.0425 537.9297 577.1056 624.7777 631.2299 677.6702 696.3707 702.2144 719.0609 729.6280 759.6571 794.7230 815.6663 830.6744 849.6021 885.1528 899.5733 909.1165 927.7347 940.3800 968.8274 983.7222 988.5229 998.7691 1022.7681 1074.6072 1082.0976 1095.3583 1111.1214 1118.0331 1155.6081 1178.2355 1185.4805 1189.7503 1206.7482 1217.4529 1228.7827 1273.9156 1282.1191 1295.8597 1301.8068 1305.1583 1335.3499 1339.1270 1369.7751 1414.6169 1421.2992 1434.5929 1457.9001 1464.5189 1467.0046 1472.2294 1477.8557 1478.4747 1501.9230 1510.9368 1592.2073 1630.8147 1639.6332 2951.3545 2994.7852 2998.5143 3010.0372 3035.9808 3062.8043 3075.0678 3085.4994 3089.7082 3106.5676 3120.9079 3160.1020 3162.3854 3195.0367 3405.3232 3522.7758 3532.2476
redmass: 4.6922 2.9643 2.9734 5.2131 4.3474 4.1983 3.8965 3.2606 3.6870 3.8466 1.1753 2.2024 5.1696 1.4288 5.9901 3.5416 3.1210 3.0439 2.7672 3.6176 2.3153 4.8637 1.2294 6.7904 2.2704 3.0733 7.7093 2.3691 3.6151 4.2932 4.1642 1.4031 3.7166 1.9416 1.4788 3.1369 2.6097 1.3880 2.6069 2.6307 2.1544 1.3073 7.7005 2.8511 2.3535 2.2805 2.0148 3.6293 1.2614 1.3260 1.3376 1.3336 1.5999 1.2553 1.4845 1.8642 1.8773 2.3330 1.4207 1.3173 1.3901 1.2422 1.2820 1.4035 4.9204 1.1387 4.2015 1.1681 1.0919 1.0506 1.0945 1.0718 1.0976 1.6603 2.2678 2.5400 6.1728 6.0071 4.4314 1.0333 1.0653 1.0638 1.0640 1.1036 1.0960 1.0926 1.1016 1.1009 1.0894 1.0987 1.0907 1.0929 1.0952 1.0752 1.0765 1.0759
irintensity: 0.3060 0.5258 1.2901 8.8895 0.2939 0.5788 8.7943 1.3307 4.4503 0.7914 0.0424 8.7655 28.5366 5.6412 0.8647 8.4555 12.4263 0.0794 5.5511 0.4316 51.0999 17.7067 135.4186 1.8773 2.7939 36.1602 15.4639 140.5077 0.0290 52.1354 2.0525 45.5645 3.9761 6.2834 65.0755 6.0552 2.6997 1.2870 7.6598 3.9661 10.8447 2.2509 44.7725 22.8720 14.5229 1.1522 4.3043 26.9626 0.2290 18.1742 0.5455 146.5716 11.2805 33.4708 221.7348 263.4502 38.7346 7.4171 2.5724 48.8541 6.1753 6.4598 3.7696 20.8258 187.8191 12.9954 2.5095 20.5463 13.7729 12.9293 9.9064 108.6785 4.1842 299.3706 2.4200 860.0013 37.2515 27.7776 127.9294 82.2185 42.3594 64.2655 26.6858 55.5730 9.2913 14.2702 22.7910 51.9195 28.9925 24.9059 7.5337 11.4644 8.3369 6.3271 9.4783 14.1514
temp: 298.150 k
press: 1.00000 atm
elementType: 8 8 7 7 7 6 6 6 6 6 6 6 6 6 6 6 6 1 1 1 1 1 1 1 1 1 1 1 1 1 1 1 1 1
symmnumber: 1
zpe: 737229.4 jmol-1
zpe.correction: 0.280796 hartree
zpe.thermalcorrener: 0.297515 hartree
zpe.thermalcorrenthalpy: 0.298459 hartree
zpe.thermalcorrgfe: 0.233825 hartree
zpe.sumelectzpe: -780.886142 hartree
zpe.sumelectthermal: -780.869423 hartree
zpe.sumelectthermalent: -780.868479 hartree
zpe.sumelectthermalfe: -780.933114 hartree
dipole: 0.1257 -5.3705 1.3253
dipole: 5.5330
quadrupole: -93.2730 -95.1159 -105.4844
quadrupole: -8.1409 -7.0565 -1.3195
quadrupole: 4.6848 2.8419 -7.5266 -8.1409 -7.0565 -1.3195
hfenergy: -781.166938 hartree
pointgroup: C01 [X(C12H17N3O2)]
dipole: -0.073459 -1.8840135 -1.0880493 debye
polarizability: 265.1966166|1.9088046|138.8743761|-4.1354888|14.6915467|99.960168 unknown
InChI: InChI=1S/C12H17N3O2/c1-17-11-4-2-9(3-5-11)14-12(16)15-10-6-7-13-8-10/h2-5,10,13-15H,6-8H2,1H3
charge 0 multiplicity 1
34 atoms
O  1.004092 1.432193 0.5774
O  -5.521437 0.452884 0.226631
N  5.550669 -1.136084 0.266056
N  2.367596 -0.33434 -0.126483
N  0.039203 -0.595939 -0.162826
C  3.625909 0.388238 0.122327
C  4.494999 0.55456 -1.17501
C  4.581743 -0.377275 1.103917
C  5.826666 -0.220683 -0.880366
C  1.122136 0.250775 0.12857
C  -1.352031 -0.307241 -0.05044
C  -2.266078 -1.338115 -0.383856
C  -1.859626 0.95425 0.37114
C  -3.660903 -1.13333 -0.306559
C  -3.248065 1.15778 0.447224
C  -4.157167 0.124995 0.111243
C  -6.489869 -0.589697 -0.110275
H  3.314435 1.359918 0.538407
H  4.677404 1.619518 -1.399787
H  3.957827 0.125426 -2.040431
H  5.147473 0.362256 1.702426
H  4.036087 -1.036923 1.798441
H  6.202328 -0.787362 -1.749283
H  6.617071 0.489693 -0.573229
H  5.15137 -2.031757 -0.055461
H  2.427787 -1.27314 -0.525618
H  0.255307 -1.540131 -0.488896
H  -1.890783 -2.317793 -0.709186
H  -1.159496 1.748847 0.633983
H  -4.335465 -1.952954 -0.571005
H  -3.650814 2.123025 0.769477
H  -6.391347 -0.908012 -1.16728
H  -7.476651 -0.129311 0.046059
H  -6.381971 -1.471775 0.55189
