program: Gaussian 09
title: 000205684
version: EM64L-G09RevD.01
frameworkgroup: C1[X(C14H21N3O2)]
method: RPBEPBE
basis: SDD
operation: Freq
keyword: #p
keyword: freq=noraman
keyword: PBEPBE/SDD
title: #p freq=noraman PBEPBE/SDD
converged: YES YES NO NO
title: Mulliken charges:
elementType: O O N N N C C C C C C C C C C C C C C H H H H H H H H H H H H H H H H H H H H H
charge: -0.305072 -0.269105 -0.040825 -0.450377 -0.495777 -0.043855 -0.497637 -0.473503 -0.437748 -0.294210 -0.675710 0.282463 0.476124 -0.437691 -0.346344 -0.333439 -0.341500 0.314835 -0.538087 0.274060 0.239451 0.218540 0.239407 0.221499 0.226470 0.222514 0.154457 0.212508 0.275064 0.234078 0.212978 0.204848 0.283046 0.214297 0.306003 0.247926 0.238544 0.219915 0.219986 0.241869
chargesum: 0.00000
title: Mulliken charges with hydrogens summed into heavy atoms:
elementType: O O N N N C C C C C C C C C C C C C C
charge: -0.305072 -0.269105 -0.040825 -0.175313 -0.212731 0.230204 -0.039646 -0.012597 0.011236 0.072755 -0.023807 0.282463 0.476124 -0.223394 -0.040341 -0.085513 -0.102957 0.314835 0.143684
polarizability: 2.86446465e+02 1.94134553e+00 1.62344444e+02 9.90207613e+00 -1.69824495e+01 1.23318393e+02
1716.lowfreq: -4.8922 -0.0010 -0.0004 0.0007 4.9604 9.7816 18.2177 18.8732 37.1426
frequency: 14.0688 18.0527 36.2041 51.9092 69.3536 77.9645 94.5209 100.4840 140.4231 163.0758 179.6868 213.6717 238.1320 240.1137 263.2915 293.3245 316.9406 331.2089 360.4937 376.7026 403.5477 414.1113 425.4724 437.5893 459.5620 522.6020 533.5732 575.1300 617.4962 628.3316 659.0400 697.6685 712.2402 719.0499 751.0300 775.2625 800.0898 809.8221 813.5808 831.8258 849.9064 872.3842 909.9309 934.6066 944.0722 954.5041 967.8539 968.0773 989.1437 999.5478 1031.1671 1046.1449 1059.8300 1084.1477 1099.2217 1110.6536 1112.4847 1116.2682 1157.6591 1169.1075 1171.4995 1178.0146 1202.7418 1214.1470 1222.7015 1251.7342 1268.1419 1273.4684 1279.8723 1295.9070 1304.9886 1318.0024 1322.4287 1337.2668 1356.4133 1372.7227 1392.1809 1418.1821 1437.0731 1457.4279 1463.3977 1465.7557 1469.1970 1471.1454 1471.9582 1474.0484 1479.2403 1488.7158 1502.6909 1510.5832 1594.2775 1632.1242 1637.1508 2812.7096 2954.8319 2984.9340 2986.4038 2997.6378 3001.6957 3017.7421 3040.3135 3056.0085 3072.9097 3076.5802 3083.5141 3090.4626 3095.9626 3109.2996 3121.4025 3154.3199 3166.8666 3191.9581 3524.2916 3534.3322
redmass: 3.8258 3.6678 4.5283 4.4990 4.5682 4.4955 2.5941 3.0778 1.8407 3.3837 3.6829 4.4679 1.3364 1.1641 3.8142 2.2569 1.4575 6.0735 2.9648 2.5990 3.1878 3.0655 2.5584 2.7241 3.6533 2.3449 4.4679 1.2207 2.4756 7.0822 4.9555 10.6935 4.1541 3.6711 4.6059 3.2282 1.2326 1.3210 3.7012 1.5852 1.9347 3.4238 2.2802 1.3661 2.3862 3.0717 1.6134 1.6386 7.4252 2.8133 2.9484 2.8731 2.4811 2.1392 1.8111 1.7657 1.2695 1.3969 1.3329 2.0355 1.4904 1.2494 1.4706 1.8919 2.2042 1.3620 2.2032 1.3935 1.1664 1.2407 1.4785 1.4581 1.3601 1.3890 1.3525 4.3584 1.2309 4.1586 1.1762 1.0763 1.1193 1.0503 1.1073 1.1825 1.0533 1.1065 1.3418 1.0818 2.2706 2.5928 6.2664 5.5982 4.5897 1.0712 1.0332 1.0370 1.0655 1.0666 1.0642 1.0866 1.1037 1.0876 1.0973 1.0985 1.1013 1.0996 1.1001 1.0898 1.0990 1.0897 1.0945 1.0946 1.0767 1.0763
irintensity: 0.1204 0.2347 0.2059 11.5332 4.7289 0.3522 2.8521 5.5585 1.4861 0.7725 8.3315 4.0426 0.6390 0.1595 5.6823 1.8245 5.2081 5.7319 6.6992 4.2499 9.1507 0.1014 1.0805 7.4560 1.3888 45.7737 20.4369 139.5147 3.7027 3.2606 16.9148 9.6341 23.9384 0.0347 5.1943 2.7539 6.3038 17.0836 2.2422 89.8774 7.8539 2.5476 3.3188 0.2266 22.9599 6.5703 1.6481 3.4407 32.1047 19.2905 17.0959 36.0701 16.5769 16.6302 4.8826 19.2192 0.6729 13.8076 0.4509 6.0473 42.4314 54.6154 6.9984 539.9545 15.7305 46.5098 5.0357 29.9823 9.2685 14.3309 12.8917 26.0510 9.4795 37.1658 3.1785 111.3571 21.4082 11.6508 31.4590 7.6792 24.3863 12.6951 38.9171 218.0581 11.5295 2.7650 123.8739 8.6289 15.0085 980.7211 20.9959 29.8179 119.5665 142.1703 75.3146 36.9686 47.6897 48.2626 19.4700 23.7513 52.8068 4.3387 19.3553 60.8899 42.2089 25.8165 44.8650 24.7102 29.0519 12.2704 7.0938 8.1510 10.1806 17.1832
temp: 298.150 k
press: 1.00000 atm
elementType: 8 8 7 7 7 6 6 6 6 6 6 6 6 6 6 6 6 6 6 1 1 1 1 1 1 1 1 1 1 1 1 1 1 1 1 1 1 1 1 1
symmnumber: 1
zpe: 881365.1 jmol-1
zpe.correction: 0.335694 hartree
zpe.thermalcorrener: 0.355121 hartree
zpe.thermalcorrenthalpy: 0.356065 hartree
zpe.thermalcorrgfe: 0.285006 hartree
zpe.sumelectzpe: -859.327135 hartree
zpe.sumelectthermal: -859.307709 hartree
zpe.sumelectthermalent: -859.306765 hartree
zpe.sumelectthermalfe: -859.377823 hartree
dipole: -1.2523 1.8842 -1.8106
dipole: 2.8977
quadrupole: -105.3186 -111.0216 -115.0802
quadrupole: -9.7176 12.7319 -3.9281
quadrupole: 5.1549 -0.5482 -4.6068 -9.7176 12.7319 -3.9281
hfenergy: -859.6628292 hartree
pointgroup: C01 [X(C14H21N3O2)]
dipole: -0.4929058 -0.6008481 -0.834097 debye
polarizability: 286.1033965|12.5459202|119.4992545|-1.8308987|10.3434577|166.5066508 unknown
InChI: InChI=1S/C14H21N3O2/c1-3-17-9-8-12(10-17)16-14(18)15-11-4-6-13(19-2)7-5-11/h4-7,12,15-16H,3,8-10H2,1-2H3
charge 0 multiplicity 1
40 atoms
O  -0.198233 0.373643 1.709583
O  6.089886 0.278462 -0.567159
N  -5.184527 0.436265 0.180223
N  -1.810006 -0.301851 0.153632
N  0.44953 -0.283121 -0.467299
C  -2.940311 -0.126429 1.07808
C  -3.870331 -1.383972 1.139992
C  -3.922526 1.049323 0.687333
C  -5.310118 -0.795604 1.015504
C  -5.199652 0.171822 -1.285864
C  -5.381078 1.462468 -2.104764
C  -0.493255 -0.039978 0.545612
C  1.863135 -0.114045 -0.403527
C  2.613492 -0.436459 -1.56962
C  2.548764 0.352168 0.746093
C  4.010357 -0.295883 -1.590608
C  3.954618 0.493695 0.724312
C  4.691733 0.172599 -0.440301
C  6.830309 0.7628 0.598105
H  -2.474316 0.082515 2.055389
H  -3.720409 -1.961564 2.067604
H  -3.648811 -2.057741 0.290868
H  -4.155837 1.637389 1.595043
H  -3.472115 1.732405 -0.050781
H  -6.037468 -1.497744 0.574203
H  -5.683569 -0.500671 2.015579
H  -4.284446 -0.368223 -1.64885
H  -6.054948 -0.501809 -1.4835
H  -2.017164 -0.617741 -0.79575
H  -6.306992 1.976597 -1.794921
H  -4.539111 2.163229 -1.958517
H  -5.444424 1.232293 -3.184611
H  0.099917 -0.632497 -1.361771
H  2.099745 -0.800787 -2.469247
H  1.976411 0.596919 1.642548
H  4.591112 -0.542392 -2.484435
H  4.456225 0.855258 1.627187
H  6.705146 0.086514 1.466731
H  6.515228 1.786775 0.880496
H  7.885234 0.772974 0.286207
