program: Gaussian 09
title: 000213641
version: EM64L-G09RevD.01
frameworkgroup: C1[X(C23H27N3O)]
method: RPBEPBE
basis: SDD
operation: Freq
keyword: #p
keyword: freq=noraman
keyword: PBEPBE/SDD
title: #p freq=noraman PBEPBE/SDD
converged: YES YES NO NO
title: Mulliken charges:
elementType: O N N N C C C C C C C C C C C C C C C C C C C C C C C H H H H H H H H H H H H H H H H H H H H H H H H H H H
charge: -0.287288 -0.059484 -0.412505 -0.156569 -0.055190 -0.468168 -0.421896 -0.372414 -0.389866 -0.348523 -0.572775 0.404593 0.110306 -0.462741 0.241296 0.164590 -0.413517 -0.351138 0.259402 -0.636185 -0.258108 -0.230122 -0.352808 -0.359537 -0.224139 -0.237803 -0.228155 0.268478 0.218531 0.209584 0.240179 0.209062 0.152511 0.219894 0.218428 0.180323 0.197161 0.220046 0.209076 0.224441 0.299890 0.266285 0.228549 0.231583 0.230798 0.238025 0.238199 0.217967 0.219430 0.274956 0.214791 0.231188 0.228031 0.231343
chargesum: 0.00000
title: Mulliken charges with hydrogens summed into heavy atoms:
elementType: O N N N C C C C C C C C C C C C C C C C C C C C C C C
charge: -0.287288 -0.059484 -0.112615 -0.156569 0.213289 -0.040053 0.027344 -0.000009 0.008885 0.068684 -0.139259 0.404593 0.110306 -0.196457 0.241296 0.164590 -0.184968 -0.119555 0.259402 0.070836 -0.040142 -0.010692 -0.077852 -0.144745 0.007048 -0.009772 0.003188
polarizability: 3.20442484e+02 -1.23416180e+01 3.03367936e+02 1.82829594e+00 2.09097270e+01 1.89050929e+02
1716.lowfreq: -5.0020 -0.0005 0.0002 0.0008 3.3516 6.9385 10.6442 14.0557 19.2402
frequency: 10.4455 13.6686 19.1943 30.1434 42.8255 58.3218 60.3080 64.7588 86.0452 106.9675 129.7591 135.4925 167.6437 180.0927 205.3139 219.9982 236.0720 239.5837 247.0764 264.7015 296.6856 321.9597 350.2742 380.9445 398.0087 403.2355 415.1046 426.9166 429.1709 478.9800 485.5893 516.0130 523.7156 529.8041 533.3374 563.2681 573.4077 612.4365 614.9984 653.8475 657.7860 671.0919 693.9610 704.7552 746.2176 746.6144 754.6657 764.8629 780.2708 787.6472 791.3093 799.8813 807.0895 817.1420 847.1132 853.3107 881.0187 906.2986 927.6933 932.1074 956.8261 967.2511 983.0777 987.5572 989.7865 1004.1514 1004.7951 1008.8648 1010.8974 1019.6418 1025.6561 1038.2444 1054.7940 1057.7174 1080.9946 1090.2268 1103.8124 1118.2866 1123.3705 1127.3494 1131.3931 1135.3160 1150.0318 1166.4140 1172.6141 1177.3675 1184.2306 1189.0363 1204.8989 1233.2197 1249.7123 1255.2350 1259.8492 1285.6029 1290.3909 1297.6906 1308.1547 1314.9419 1332.0171 1335.5311 1336.0844 1350.4681 1363.0206 1364.1480 1366.9002 1372.6335 1384.3227 1394.1814 1412.8722 1431.8849 1435.1010 1445.0901 1457.8287 1459.8843 1461.6698 1466.8116 1470.7679 1473.2063 1474.0875 1481.1906 1484.4503 1491.0973 1495.4418 1561.9602 1567.6579 1581.0707 1602.7310 1611.1669 1625.4096 2762.3321 2831.6167 2860.2776 2974.3197 2981.7982 2997.6455 3001.7412 3023.9134 3030.9236 3034.5958 3040.9830 3049.8282 3053.5237 3063.6897 3073.4472 3105.1965 3116.5107 3119.8766 3129.4752 3130.7058 3143.3890 3143.7686 3157.3063 3160.5627 3168.7927 3209.5829 3543.1997
redmass: 5.0729 4.9835 4.2655 4.1050 4.9331 3.3096 2.1399 1.5904 4.0662 3.7947 4.5324 2.7844 3.5687 3.8427 3.1966 2.9386 3.6708 3.0357 3.0730 3.4990 3.2190 4.2299 2.7571 2.3840 3.3497 2.8688 2.7521 2.9143 3.2513 3.1603 4.8997 2.7062 3.3026 3.0101 1.6596 4.7852 3.7486 3.4792 6.3365 3.7552 6.0617 2.7568 3.3063 1.6441 3.4405 1.3178 3.5822 4.0061 2.0833 1.5356 2.4093 1.7157 2.0029 3.3734 1.5004 1.2546 3.3756 2.4602 1.3809 1.4673 2.5001 1.2965 1.4032 2.6072 5.3901 1.8800 1.3488 2.4878 2.1756 1.9589 2.3052 3.1564 2.1349 2.1630 1.5792 1.5443 2.3471 1.3047 2.5041 1.7192 1.8537 2.6998 2.6134 1.2141 1.0590 1.2272 1.1587 1.1266 1.4787 1.7403 1.6281 1.6279 1.4736 1.3571 1.1903 1.5203 1.4942 1.3299 1.9854 1.7164 1.3913 1.4814 1.5194 1.7374 1.9894 2.6876 9.2194 1.4372 4.3671 2.2074 1.5419 1.1031 1.1484 1.6085 1.1010 1.0418 2.5971 1.1053 1.1840 2.5607 1.2831 1.7408 1.1708 6.1634 6.7638 6.7859 6.8026 6.1286 7.2192 1.0714 1.0708 1.0702 1.0357 1.0624 1.0619 1.0629 1.0874 1.0856 1.0854 1.0869 1.1019 1.0995 1.1011 1.1015 1.0984 1.0871 1.0850 1.0885 1.0869 1.0949 1.0921 1.0956 1.1001 1.1006 1.0979 1.0772
irintensity: 0.7765 1.1951 0.7839 0.2995 1.2046 6.6657 0.2826 0.9301 0.1253 0.2403 1.9076 3.2631 1.5608 1.0082 7.7852 1.1473 1.3612 1.4091 7.8398 1.9818 0.7611 0.4727 4.9236 2.4529 2.0486 0.3102 4.5472 10.4836 4.3998 3.2297 0.8129 11.5843 0.2879 25.7894 50.4076 10.8363 0.0505 1.8919 0.4597 6.6859 15.3310 12.7136 2.9064 88.8342 3.3130 112.9065 6.4894 2.1469 4.8964 7.6869 18.4855 5.5620 7.4216 1.8323 0.1782 1.1852 8.1070 8.4430 1.7410 3.8405 5.0171 0.0368 1.5298 26.7618 0.3108 0.5516 1.5059 7.9245 3.7485 9.5738 4.6627 19.1099 7.3153 23.9592 17.0126 8.1489 16.1355 1.0038 31.6930 7.4236 24.2380 1.9886 51.7997 5.6670 1.1094 1.7337 10.9054 7.4175 6.3625 8.6813 14.1286 51.2792 21.6128 12.3273 10.5149 15.0982 10.2332 1.8036 20.3665 27.9998 19.0067 12.0544 5.4388 11.5342 2.9941 34.1356 1.3895 0.4764 32.2509 14.5826 1.3649 30.7190 68.1719 250.3208 14.8949 12.9020 14.0849 5.7140 3.0953 47.0781 36.1490 136.5380 11.8344 7.4338 104.7686 0.3689 52.1650 3.4888 5.1745 115.1636 88.4577 109.8325 90.1842 32.3875 26.3901 17.4514 5.4116 47.9114 35.1071 37.4884 29.0975 36.9910 28.2205 32.9237 11.8027 12.0815 4.1627 6.1579 1.9224 45.2189 23.5516 16.1247 28.7867 21.8947 1.2274 23.9229
temp: 298.150 k
press: 1.00000 atm
elementType: 8 7 7 7 6 6 6 6 6 6 6 6 6 6 6 6 6 6 6 6 6 6 6 6 6 6 6 1 1 1 1 1 1 1 1 1 1 1 1 1 1 1 1 1 1 1 1 1 1 1 1 1 1 1
symmnumber: 1
zpe: 1188227.0 jmol-1
zpe.correction: 0.452572 hartree
zpe.thermalcorrener: 0.477258 hartree
zpe.thermalcorrenthalpy: 0.478202 hartree
zpe.thermalcorrgfe: 0.393569 hartree
zpe.sumelectzpe: -1130.173308 hartree
zpe.sumelectthermal: -1130.148622 hartree
zpe.sumelectthermalent: -1130.147678 hartree
zpe.sumelectthermalfe: -1130.232311 hartree
dipole: 4.2766 1.7042 -0.3019
dipole: 4.6136
quadrupole: -152.3033 -155.0221 -157.2436
quadrupole: -26.1308 -12.4623 2.5075
quadrupole: 2.5530 -0.1658 -2.3873 -26.1308 -12.4623 2.5075
hfenergy: -1130.62588 hartree
pointgroup: C01 [X(C23H27N3O1)]
dipole: -1.6915145 0.6478507 0.1170884 debye
polarizability: 320.0989041|12.5098339|303.1014847|1.3601499|-22.5798968|189.66096 unknown
InChI: InChI=1S/C23H27N3O/c1-25-17-19(21-9-5-6-10-22(21)25)11-14-26-15-12-20(13-16-26)24-23(27)18-7-3-2-4-8-18/h2-10,17,20,24H,11-16H2,1H3
charge 0 multiplicity 1
54 atoms
O  5.2652 -1.830873 0.457305
N  -0.173423 -1.827782 -0.097886
N  3.385686 -0.87793 -0.515952
N  -5.995947 -0.581446 0.847626
C  2.70872 -2.180758 -0.71465
C  1.627529 -2.056052 -1.81162
C  2.061085 -2.699573 0.597261
C  0.401641 -1.246582 -1.332102
C  0.835421 -1.858283 0.995629
C  -1.434906 -1.165252 0.319142
C  -2.646783 -1.557561 -0.56941
C  -3.930311 -0.906267 -0.115266
C  -4.310998 0.486862 -0.285352
C  -4.979647 -1.5149 0.574654
C  -5.605718 0.658229 0.325862
C  4.643944 -0.793692 0.053111
C  -3.692226 1.60629 -0.903257
C  -6.279776 1.900451 0.336813
C  5.242222 0.587081 0.178528
C  -7.255311 -0.847609 1.541803
C  -4.359734 2.846692 -0.897995
C  -5.639057 2.992932 -0.28265
C  6.297942 0.755619 1.110526
C  4.823357 1.698198 -0.600063
C  6.908206 2.015272 1.281048
C  5.437975 2.959032 -0.432794
C  6.476987 3.122751 0.512555
H  3.494839 -2.892665 -1.024735
H  1.286328 -3.073588 -2.075285
H  2.055385 -1.595019 -2.722563
H  2.815723 -2.693238 1.40335
H  1.741067 -3.746657 0.436416
H  0.685907 -0.166408 -1.171379
H  -0.364259 -1.248422 -2.127393
H  0.359564 -2.295791 1.89237
H  1.166888 -0.822231 1.27297
H  -1.331925 -0.050121 0.337926
H  -1.655526 -1.478452 1.356587
H  -2.442468 -1.276687 -1.621537
H  -2.737497 -2.658964 -0.548285
H  2.861827 -0.025079 -0.717609
H  -5.083479 -2.55228 0.891007
H  -2.710753 1.507362 -1.381772
H  -7.263261 2.01888 0.804917
H  -7.289266 -1.905963 1.845727
H  -7.348373 -0.222123 2.449265
H  -8.122806 -0.645883 0.885616
H  -3.894257 3.717955 -1.372511
H  -6.131763 3.971734 -0.293616
H  6.62402 -0.121145 1.679633
H  4.047715 1.586002 -1.367707
H  7.719262 2.135135 2.007726
H  5.114956 3.808477 -1.044813
H  6.952177 4.10162 0.641631
