program: Gaussian 09
title: 000205681
version: EM64L-G09RevD.01
frameworkgroup: C1[X(C12H23O3PS)]
method: RPBEPBE
basis: SDD
operation: Freq
keyword: #p
keyword: freq=noraman
keyword: PBEPBE/SDD
title: #p freq=noraman PBEPBE/SDD
converged: YES YES NO NO
title: Mulliken charges:
elementType: S P O O O C C C C C C C C C C C C H H H H H H H H H H H H H H H H H H H H H H H
charge: -0.276303 0.930615 -0.537918 -0.475474 -0.465444 0.411633 -0.081642 -0.466909 -0.513840 -0.463965 -0.452308 -0.741421 0.483322 -0.832723 -0.728700 -0.476418 -0.481434 0.167757 0.223520 0.194886 0.207033 0.236036 0.247518 0.198682 0.206509 0.250104 0.251443 0.222549 0.212182 0.222495 0.222921 0.227116 0.209566 0.225428 0.245268 0.240671 0.239495 0.235433 0.243336 0.238979
chargesum: 0.00000
title: Mulliken charges with hydrogens summed into heavy atoms:
elementType: S P O O O C C C C C C C C C C C C
charge: -0.276303 0.930615 -0.537918 -0.475474 -0.465444 0.411633 0.086115 -0.048503 -0.070771 -0.017765 0.004305 -0.055247 0.483322 -0.160191 -0.293705 0.249016 0.236315
polarizability: 2.00409491e+02 -2.60434608e+00 1.81186105e+02 -9.61982550e+00 1.44801951e+00 1.52740065e+02
1716.lowfreq: -25.2879 -10.1588 -1.5671 -0.0025 -0.0021 -0.0016 13.2789 30.2243 41.0962
frequency: 4.6964 30.0331 40.8501 42.4560 58.7952 86.8102 96.0368 102.9822 112.2979 138.5807 141.6009 158.7941 168.0395 175.6327 202.5639 210.9442 213.4977 241.4756 262.9716 279.6033 291.2584 323.4573 341.8294 361.2223 384.0576 411.3159 434.4885 456.4791 459.5799 492.4952 503.0249 534.6610 586.2052 629.0351 672.8319 682.0558 700.6144 755.5603 772.5910 822.0803 840.9026 884.7924 896.2298 925.0957 928.3410 944.8082 959.2081 976.5177 986.4845 994.9054 1002.1676 1023.5643 1042.3933 1059.1968 1086.5886 1112.5162 1113.5021 1129.1606 1130.6951 1131.7523 1140.0580 1145.6373 1181.7055 1222.2010 1258.6313 1270.5505 1277.7324 1290.7052 1320.4239 1327.1734 1332.3113 1358.2803 1371.5920 1384.4438 1392.4268 1419.9119 1422.5679 1428.0120 1441.3187 1453.5425 1456.8800 1459.6531 1460.1797 1463.8925 1465.2930 1470.4143 1471.8941 1476.4923 1477.4454 1481.8724 1666.5382 2913.2181 2962.1736 2968.6767 2977.7124 2978.4615 2983.6164 2985.9633 2995.4662 2997.8667 3025.2274 3034.3182 3044.2674 3059.6250 3063.9244 3080.0600 3082.7362 3083.0947 3088.9763 3094.9523 3096.4206 3126.9648 3130.2066 3197.2251
redmass: 4.8366 2.6977 3.9121 3.4467 3.2591 2.1361 1.3538 1.5851 1.9688 4.0049 2.9038 3.1627 1.2634 2.6381 1.3144 3.1514 2.4124 4.6094 2.8172 3.3512 5.4571 2.9985 2.4562 3.3701 4.1533 3.9120 2.6732 3.6014 3.0537 2.5230 4.7857 2.3676 2.7570 6.6980 11.3472 11.7609 1.1765 2.6937 1.5746 2.8417 4.2796 2.7031 1.9258 1.4135 1.3323 1.9270 10.9237 6.9080 1.7502 1.8434 1.5885 1.5655 1.6769 1.8067 1.6062 1.2442 1.2481 1.6502 1.5693 1.3057 1.9429 2.0691 1.8404 1.5348 1.6436 1.3725 1.7933 1.3202 1.4482 1.4010 1.4764 1.6430 1.6049 1.2155 1.2216 1.1205 1.1204 1.1823 1.0835 1.0508 1.0507 1.0752 1.0769 1.0537 1.0666 1.0534 1.0521 1.0561 1.0593 1.0823 4.8711 1.0815 1.0375 1.0608 1.0585 1.0305 1.0302 1.0393 1.0609 1.0624 1.0992 1.0963 1.0983 1.1024 1.1015 1.1046 1.0982 1.0984 1.1043 1.1005 1.0629 1.1025 1.1036 1.1128
irintensity: 0.4992 0.2111 1.1359 2.8321 4.5166 2.3152 1.2931 0.4231 1.8669 3.0581 2.1924 1.8080 0.8035 1.0982 1.6098 1.1391 3.9264 12.9751 4.5221 1.1061 5.6326 4.8671 2.0591 1.0426 7.5534 15.5857 4.4748 3.8641 6.4468 2.5188 5.5440 5.8512 5.9189 31.5343 122.5731 144.9176 0.4242 18.1035 0.8462 64.5447 267.8860 3.6129 12.0169 10.3570 66.1242 22.7860 200.8799 101.5288 5.4481 5.5944 1.8670 4.7707 0.9994 1.0731 0.4150 0.2949 0.5831 11.2288 15.5081 0.6306 7.5229 6.8178 10.7225 18.1520 9.9195 1.9600 2.4895 8.5868 12.2269 8.7845 5.3063 6.9985 3.5450 22.8029 25.4521 4.7748 5.0252 1.4508 5.7436 10.4198 11.1620 4.5996 5.7426 22.2414 7.8971 25.8696 14.6873 27.3233 10.0366 3.3199 27.5758 34.2786 34.1408 13.3090 16.4014 49.5473 50.3634 46.8421 44.5855 18.7030 25.4016 24.8008 24.5585 15.5985 35.5972 25.3009 38.9735 32.4559 20.7664 12.0000 10.2522 14.9022 13.3886 27.9352
temp: 298.150 k
press: 1.00000 atm
elementType: 16 15 8 8 8 6 6 6 6 6 6 6 6 6 6 6 6 1 1 1 1 1 1 1 1 1 1 1 1 1 1 1 1 1 1 1 1 1 1 1
symmnumber: 1
zpe: 875147.6 jmol-1
zpe.correction: 0.333326 hartree
zpe.thermalcorrener: 0.355211 hartree
zpe.thermalcorrenthalpy: 0.356155 hartree
zpe.thermalcorrgfe: 0.279597 hartree
zpe.sumelectzpe: -1434.632385 hartree
zpe.sumelectthermal: -1434.610500 hartree
zpe.sumelectthermalent: -1434.609556 hartree
zpe.sumelectthermalfe: -1434.686114 hartree
dipole: -0.6176 -1.0446 0.6510
dipole: 1.3771
quadrupole: -117.7615 -109.8692 -120.8673
quadrupole: 5.8395 8.0927 -3.8636
quadrupole: -1.5955 6.2968 -4.7013 5.8395 8.0927 -3.8636
hfenergy: -1434.9657108 hartree
pointgroup: C01 [X(C12H23O3P1S1)]
dipole: 0.2548358 0.3255892 0.3501018 debye
polarizability: 201.6731161|-4.0289166|179.125408|4.9521777|7.470427|153.537136 unknown
InChI: InChI=1S/C12H23O3PS/c1-10(2)11-6-8-12(3,9-7-11)15-16(17,13-4)14-5/h11H,1,6-9H2,2-5H3
charge 0 multiplicity 1
40 atoms
S  -3.699924 0.435213 -1.130573
P  -2.251742 -0.483077 0.040021
O  -0.953787 0.393244 0.727421
O  -1.400454 -1.805121 -0.671771
O  -2.832783 -1.28846 1.45627
C  -0.211188 1.568011 0.090773
C  2.514277 0.358195 -0.457353
C  0.982387 1.7417 1.059268
C  0.266109 1.202596 -1.334561
C  1.997446 0.58185 0.997093
C  1.303271 0.056818 -1.371056
C  -1.133477 2.798478 0.106408
C  3.625021 -0.695569 -0.494807
C  4.989739 -0.221898 -0.018317
C  3.429948 -1.975632 -0.911385
C  -2.197252 -2.848284 -1.360224
C  -3.747427 -0.553018 2.355855
H  2.963769 1.322361 -0.793157
H  0.586664 1.855696 2.085629
H  1.483747 2.694794 0.792449
H  0.712112 2.122397 -1.76598
H  -0.610322 0.956501 -1.965871
H  1.516663 -0.349492 1.348985
H  2.839278 0.798424 1.681809
H  1.643401 -0.094376 -2.413474
H  0.813446 -0.879616 -1.048367
H  -2.002449 2.660617 -0.559015
H  -1.499972 2.990511 1.130483
H  -0.571925 3.688325 -0.232648
H  5.369617 0.593751 -0.665438
H  4.941906 0.185536 1.010517
H  5.731331 -1.038977 -0.025365
H  4.247951 -2.706114 -0.90637
H  2.458635 -2.333399 -1.267886
H  -2.7543 -3.448336 -0.620393
H  -1.453123 -3.470499 -1.878908
H  -2.893164 -2.392656 -2.088806
H  -3.199646 0.242076 2.892224
H  -4.1102 -1.310044 3.066734
H  -4.594282 -0.120826 1.790686
