program: Gaussian 09
title: 000205676
version: EM64L-G09RevD.01
frameworkgroup: C1[X(C21H28N2O)]
method: RPBEPBE
basis: SDD
operation: Freq
keyword: #p
keyword: freq=noraman
keyword: PBEPBE/SDD
title: #p freq=noraman PBEPBE/SDD
converged: YES YES NO NO
title: Mulliken charges:
elementType: O N N C C C C C C C C C C C C C C C C C C C C C H H H H H H H H H H H H H H H H H H H H H H H H H H H H
charge: -0.303447 -0.370996 -0.159721 -0.065753 -0.536544 -0.648808 0.437924 -0.702168 0.503289 0.408461 0.230300 -0.395820 -0.397935 -0.374635 -0.372840 -0.391638 -0.432535 -0.405702 -0.417007 -0.663497 -0.661983 -0.260098 -0.234744 -0.248733 0.250549 0.200157 0.224981 0.324786 0.244782 0.240119 0.211218 0.239014 0.200019 0.225297 0.220299 0.222404 0.220551 0.229280 0.226462 0.242533 0.229499 0.271746 0.225714 0.215627 0.214331 0.238400 0.216601 0.239431 0.213506 0.229424 0.221798 0.226101
chargesum: 0.00000
title: Mulliken charges with hydrogens summed into heavy atoms:
elementType: O N N C C C C C C C C C C C C C C C C C C C C C
charge: -0.303447 -0.046210 -0.159721 0.184795 -0.111406 -0.163907 0.437924 -0.051917 0.503289 0.408461 0.230300 0.049776 0.045020 -0.145355 -0.146377 -0.149105 -0.203035 -0.133956 -0.191292 0.004860 0.007556 -0.030674 -0.012947 -0.022632
polarizability: 2.65284527e+02 -2.30181843e+01 2.56202743e+02 -3.56217873e+01 -2.20586057e+00 2.04854079e+02
1716.lowfreq: -10.3817 -5.2780 -0.0007 -0.0006 -0.0004 2.0233 3.1660 14.2077 20.2725
frequency: -6.3525 13.8846 20.1033 28.5367 42.3795 56.2554 57.8714 68.9028 83.4754 94.4849 105.2872 128.8935 133.2359 180.0709 199.3520 204.2974 206.9839 221.2118 244.4746 253.5766 289.9887 302.4516 320.1859 339.7825 353.6867 403.3340 404.8336 413.0373 426.7891 440.1615 455.2853 472.7450 505.6811 531.3833 544.6783 566.7510 595.1742 612.1852 619.0143 625.0208 637.3001 684.7490 704.2734 730.7852 735.7451 780.7490 785.4002 794.9871 806.0502 810.8242 827.6167 855.3397 860.9309 890.9517 893.7416 907.9907 917.4803 923.4107 936.8291 940.4710 955.6426 971.7534 976.8205 989.5786 995.7155 998.1044 1015.2851 1029.4866 1067.0417 1072.5012 1077.2999 1089.5837 1094.2458 1103.6938 1128.9228 1155.7326 1159.3934 1171.5551 1178.9563 1195.5249 1197.5786 1203.8465 1206.3117 1208.7707 1226.2426 1247.7043 1266.6925 1287.4251 1289.2525 1296.7102 1321.9882 1325.8356 1341.7953 1342.9536 1351.6246 1362.2889 1370.9661 1379.7129 1383.8306 1384.2925 1385.8152 1400.1892 1431.0376 1437.2496 1445.0179 1451.1931 1466.0238 1466.2747 1467.4344 1473.5535 1474.9331 1481.3393 1487.4614 1490.4569 1491.6142 1504.5348 1526.5437 1559.4632 1591.4220 1599.9548 1615.8201 1632.4321 2956.1422 2975.5036 2981.3137 2982.2380 2985.0886 2991.2797 3000.6824 3000.7549 3032.7505 3034.1049 3039.6197 3053.3875 3071.3716 3076.9672 3077.0780 3089.8047 3092.3478 3092.9036 3107.0003 3114.0469 3118.0089 3122.0777 3132.9136 3143.4889 3159.0481 3159.9510 3163.8616 3504.9108
redmass: 4.8696 3.6896 3.8526 4.1459 4.2461 7.1088 3.0787 3.8109 3.2008 2.6911 3.0683 3.9907 3.7032 1.9241 1.5916 1.0850 1.9389 1.5531 2.0507 3.0568 3.4924 3.1270 2.6035 3.2446 3.4357 2.8660 3.1348 3.1266 3.1119 2.8123 3.1104 2.7825 2.7138 3.0657 3.0805 3.9398 3.9458 3.7935 3.7941 1.3853 6.8851 3.5188 2.1997 2.7086 1.7090 1.1753 1.2299 3.5323 1.9954 1.3178 2.4781 1.2528 2.2214 2.3232 1.7485 2.2988 2.1346 1.9762 1.5733 1.4430 1.3521 2.2375 1.4203 3.9619 1.4470 2.9973 2.9589 2.1997 1.7548 2.1322 1.8136 3.2538 1.6665 1.7086 1.5613 2.3151 1.9920 1.0596 1.1466 1.3125 1.3371 1.1979 2.3428 2.0661 1.6662 2.0090 1.4087 1.6250 1.2223 1.5821 1.3604 1.3204 1.2897 1.3170 1.3317 1.3705 4.2646 2.2756 1.2187 1.8017 1.2401 2.0325 3.2997 1.8021 1.1556 1.1805 1.0473 1.1303 1.0448 1.0524 1.0585 1.0508 2.0575 1.0958 1.7782 1.1787 2.5449 6.3902 5.8846 7.8192 5.9097 6.2317 1.0597 1.0367 1.0357 1.0361 1.0600 1.0606 1.0619 1.0963 1.0865 1.1026 1.1022 1.0997 1.0984 1.0997 1.0994 1.1009 1.0997 1.1005 1.0871 1.0893 1.0894 1.0861 1.0916 1.0959 1.0924 1.1015 1.0932 1.0770
irintensity: 0.0952 0.0134 0.0112 0.2503 1.1707 9.7668 0.2846 0.9625 0.8639 0.4207 0.3159 1.0398 0.6699 1.8905 1.0188 0.6098 0.5660 0.7961 4.5568 2.8954 0.7426 0.6163 1.4370 2.7850 6.1848 1.9121 10.7830 2.2069 0.6608 1.8190 3.8224 15.1056 23.4506 3.1837 1.9763 18.0488 6.6997 8.1429 3.7361 68.8614 0.3136 0.0324 39.7750 12.3138 60.2937 10.0015 14.4347 1.6135 32.5952 7.7261 9.9938 1.0979 11.3679 0.5511 3.7200 3.2594 0.2216 7.4553 5.6353 1.8417 0.2256 16.4026 0.2508 0.0334 1.5097 0.4598 24.9479 6.1656 8.3186 13.9656 18.0901 13.6599 18.0288 9.8370 0.7026 32.7212 20.8588 0.5914 3.5853 1.7927 8.0515 16.3764 48.1434 0.9005 6.3884 54.8137 80.9365 7.7146 4.1372 0.4248 2.6911 1.5221 21.3804 15.7040 73.7508 2.8854 4.2120 5.8549 3.7405 11.9785 40.9439 61.6185 4.7489 10.1163 61.3522 8.4653 5.4814 45.2367 10.0795 16.7175 0.5709 1.2077 49.4129 15.1382 132.6205 15.4494 246.5874 8.5093 10.9526 239.1331 13.1703 178.6505 25.2170 32.9664 25.4715 32.0968 52.8178 48.0823 23.8303 10.4802 9.8639 6.6280 17.0182 4.7724 54.2496 8.0748 80.4253 30.5704 23.0177 63.3683 9.7558 12.6733 18.0740 0.8822 18.0990 24.2952 26.3479 28.0465 12.0932 56.2367
temp: 298.150 k
press: 1.00000 atm
elementType: 8 7 7 6 6 6 6 6 6 6 6 6 6 6 6 6 6 6 6 6 6 6 6 6 1 1 1 1 1 1 1 1 1 1 1 1 1 1 1 1 1 1 1 1 1 1 1 1 1 1 1 1
symmnumber: 1
zpe: 1163680.2 jmol-1
zpe.correction: 0.443222 hartree
zpe.thermalcorrener: 0.467188 hartree
zpe.thermalcorrenthalpy: 0.468133 hartree
zpe.thermalcorrgfe: 0.387029 hartree
zpe.sumelectzpe: -999.987576 hartree
zpe.sumelectthermal: -999.963610 hartree
zpe.sumelectthermalent: -999.962666 hartree
zpe.sumelectthermalfe: -1000.043769 hartree
dipole: -5.4858 2.9479 2.9716
dipole: 6.9003
quadrupole: -139.6888 -143.3090 -141.9560
quadrupole: 4.1364 0.5489 -7.3267
quadrupole: 1.9624 -1.6577 -0.3047 4.1364 0.5489 -7.3267
hfenergy: -1000.4307986 hartree
pointgroup: C01 [X(C21H28N2O1)]
dipole: -2.1645713 1.4511674 -0.7608118 debye
polarizability: 266.7042229|-39.0483081|207.9630203|9.5417114|-17.8452103|251.6741056 unknown
InChI: InChI=1S/C21H28N2O/c1-4-23(5-2)20-13-11-19(12-14-20)16-21(24)22-17(3)15-18-9-7-6-8-10-18/h6-14,17,22H,4-5,15-16H2,1-3H3
charge 0 multiplicity 1
52 atoms
O  2.776596 -1.950145 2.258523
N  1.454591 -0.099915 1.751493
N  -4.221191 0.243938 -0.718945
C  2.501686 0.904797 2.016455
C  2.714057 1.830808 0.791202
C  0.461811 -2.367935 1.548179
C  -3.094854 -0.386055 -0.169633
C  2.165434 1.728004 3.281293
C  3.078326 1.149836 -0.526444
C  -0.765476 -1.694574 0.960916
C  1.665213 -1.456216 1.883108
C  -4.330866 0.507886 -2.16645
C  -5.36338 0.65459 0.119111
C  -1.937157 -0.676365 -0.963713
C  -3.046382 -0.770966 1.209423
C  -0.814522 -1.316157 -0.407253
C  -1.908229 -1.40236 1.748251
C  3.747474 -0.1007 -0.581858
C  2.781385 1.808713 -1.748428
C  -3.703058 1.852674 -2.606157
C  -6.419764 -0.458118 0.32501
C  4.114641 -0.666132 -1.824784
C  3.14982 1.247996 -2.991508
C  3.821721 0.004184 -3.034433
H  3.418962 0.320515 2.2139
H  1.801806 2.445784 0.643795
H  3.516968 2.547675 1.062513
H  0.541657 0.209988 1.405487
H  0.862686 -3.13848 0.86348
H  0.210179 -2.898324 2.48602
H  2.972322 2.450812 3.502987
H  2.048609 1.061029 4.152548
H  1.224494 2.296089 3.150063
H  -3.875088 -0.327661 -2.730036
H  -5.405658 0.502892 -2.430774
H  -4.993114 1.013785 1.097523
H  -5.841925 1.527515 -0.364753
H  -1.90395 -0.393879 -2.019749
H  -3.90618 -0.599933 1.863469
H  0.051501 -1.516361 -1.051282
H  -1.916315 -1.687606 2.808197
H  3.975203 -0.649844 0.33873
H  2.257445 2.773406 -1.724299
H  -4.188931 2.699691 -2.088409
H  -3.824197 2.001011 -3.695648
H  -2.625332 1.884719 -2.369135
H  -6.837689 -0.785647 -0.644309
H  -5.97642 -1.341409 0.816506
H  -7.254189 -0.091822 0.952062
H  4.629111 -1.633747 -1.845025
H  2.913046 1.777831 -3.921599
H  4.110123 -0.436317 -3.995623
