program: Gaussian 09
title: 000205674
version: EM64L-G09RevD.01
frameworkgroup: C1[X(C10H10N2O4)]
method: RPBEPBE
basis: SDD
operation: Freq
keyword: #p
keyword: freq=noraman
keyword: PBEPBE/SDD
title: #p freq=noraman PBEPBE/SDD
converged: NO YES NO NO
title: Mulliken charges:
elementType: O O O O N N C C C C C C C C C C H H H H H H H H H H
charge: -0.230554 -0.395197 -0.283887 -0.252394 -0.069486 -0.574103 -0.524555 -0.197599 0.252886 0.144534 0.150697 -0.347785 0.234522 -0.347816 -0.247573 -0.184198 0.292029 0.241537 0.272433 0.239403 0.362619 0.269355 0.240445 0.240487 0.331352 0.382849
chargesum: 0.00000
title: Mulliken charges with hydrogens summed into heavy atoms:
elementType: O O O O N N C C C C C C C C C C
charge: -0.230554 -0.032578 -0.283887 -0.252394 -0.069486 0.140097 0.009011 0.074833 0.252886 0.144534 0.150697 -0.108382 0.234522 -0.078461 -0.007128 0.056289
polarizability: 2.39560639e+02 -5.04599801e+00 1.39203939e+02 -7.11598883e+00 2.56605651e+00 7.70304119e+01
1716.lowfreq: -4.3779 -0.0007 -0.0002 0.0007 4.6630 8.5443 52.3594 58.5826 80.9979
frequency: 52.3365 58.5276 80.9836 93.3959 138.4522 171.2753 226.9908 230.3971 238.6752 270.2765 323.4234 344.9558 381.4252 390.9131 419.1055 431.4362 449.6308 494.7141 520.5319 534.0444 563.9232 575.3315 595.5337 617.2846 633.5879 661.5138 731.3456 736.3589 764.3112 778.2361 784.7865 841.3702 867.4596 869.6348 892.0798 933.5896 955.3454 963.1459 992.0725 1020.3396 1044.8050 1115.7241 1129.3370 1141.8729 1171.5059 1204.6771 1240.7868 1250.7142 1272.4375 1318.0591 1340.7910 1377.8926 1401.0754 1433.4174 1442.8197 1470.1513 1545.0082 1553.1959 1604.3422 1620.2903 1628.3661 1663.6699 3031.2448 3103.7461 3114.1664 3130.3261 3144.3109 3169.1053 3180.1165 3364.5631 3513.6147 3612.3886
redmass: 7.2579 5.3731 5.8410 7.0726 5.0424 6.2768 5.7442 4.2998 3.3837 1.7151 3.2673 4.7785 4.9552 5.4941 3.6611 2.8997 3.1271 5.0297 3.7597 3.6002 6.3182 5.2491 2.2206 6.2441 5.4925 2.2586 3.7821 3.8173 1.3234 1.5173 3.2237 3.9105 5.6442 1.5537 5.4056 1.5745 1.9375 1.5209 1.3380 2.2714 3.5644 1.8507 1.7352 1.2464 1.0807 1.2245 2.5811 2.0331 1.6337 1.2486 3.4637 1.6756 8.0663 1.6944 1.4215 2.9066 6.0432 3.7202 6.0303 2.9852 2.1051 5.5361 1.0584 1.0930 1.1050 1.0889 1.0893 1.0948 1.0990 1.0597 1.0657 1.0926
irintensity: 2.6828 3.6670 15.4750 5.9879 5.1042 10.2058 3.3676 8.7064 23.5498 50.1597 12.5580 4.1287 7.5887 6.5168 21.4014 17.6314 11.0746 6.3025 9.6507 21.8904 12.0695 18.4137 117.4698 78.0903 77.0369 12.5448 75.3790 18.2869 90.3975 153.3775 13.2018 0.9765 187.0049 16.9481 44.6290 12.7131 11.9478 21.5627 0.6305 7.6407 6.1616 15.1465 4.7452 154.9851 9.3313 1.5960 45.3735 43.7232 59.5440 7.6715 182.8799 19.7089 2.8440 71.1957 37.0879 28.6104 48.5194 588.7359 40.4805 103.2274 56.1494 325.5357 8.7234 6.3562 3.7008 2.9482 7.9747 12.4207 12.5390 150.6929 2.4973 71.6973
temp: 298.150 k
press: 1.00000 atm
elementType: 8 8 8 8 7 7 6 6 6 6 6 6 6 6 6 6 1 1 1 1 1 1 1 1 1 1
symmnumber: 1
zpe: 502211.8 jmol-1
zpe.correction: 0.191282 hartree
zpe.thermalcorrener: 0.205518 hartree
zpe.thermalcorrenthalpy: 0.206462 hartree
zpe.thermalcorrgfe: 0.150371 hartree
zpe.sumelectzpe: -796.292330 hartree
zpe.sumelectthermal: -796.278094 hartree
zpe.sumelectthermalent: -796.277150 hartree
zpe.sumelectthermalfe: -796.333241 hartree
dipole: -4.6790 3.2601 -0.1361
dipole: 5.7043
quadrupole: -81.5826 -101.7123 -92.4927
quadrupole: -8.6282 -4.1462 -5.6815
quadrupole: 10.3466 -9.7831 -0.5635 -8.6282 -4.1462 -5.6815
hfenergy: -796.4836125 hartree
pointgroup: C01 [X(C10H10N2O4)]
dipole: 1.9152801 1.1638517 -0.1177006 debye
dipolederiv: -1.3101669 -0.5635053 0.0639057 -0.2559326 -0.5752157 0.0250771 0.1298272 0.1634328 -0.3712157 -0.3800619 0.017193 -0.0344062 0.0687268 -0.4344387 0.0682673 -0.2447225 -0.1323103 -0.9870286 -1.0990009 -0.3130838 0.1811403 -0.4385407 -0.827171 0.1515829 0.2519888 0.1894614 -0.6339636 -0.713924 0.2170902 -0.0413207 0.2585534 -0.9999788 -0.0653726 -0.2957886 0.1409215 -0.3729222 -0.4284234 -0.0958208 0.0733623 -0.5791111 -0.508974 0.0321222 -0.2594179 -0.1175935 -0.3512285 -0.8896734 -0.3507805 0.0765265 -0.2849216 -0.8338337 -0.0782938 -0.0332488 -0.1443198 -0.4653014 -0.4263565 0.0771967 -0.120018 -0.0043635 0.0830614 0.0579204 -0.2538605 0.0712058 0.175683 1.0603368 -0.1109944 -0.3241896 -0.0926034 0.2032848 0.0061065 -0.3154207 0.0683337 0.119637 -0.7710192 0.2514171 0.2012819 0.1060059 -0.2849767 -0.0625528 0.2883057 -0.1087849 -0.1613619 2.0151557 0.7187293 -0.1110921 0.7060748 1.3568625 -0.100814 0.0215994 0.0437745 1.4621581 0.6063659 0.505636 -0.1600701 0.2154633 0.5007257 0.0350313 -0.2898818 -0.1759649 0.1512511 0.4793815 -0.2227498 -0.1713701 0.2204804 0.0834958 -0.0588664 -0.1314755 0.0708859 -0.0693532 1.2354094 -0.0234661 0.2696888 0.1463059 1.4115074 0.0784992 0.8978065 -0.0216452 0.265466 -0.377509 -0.3605451 0.0443291 -0.1168001 0.0488799 0.0048219 0.0913239 0.0723032 -0.180669 -0.2694972 0.2655566 0.0125599 0.3523616 -0.2331498 -0.103892 0.031984 -0.0971675 -0.1910354 0.0839412 0.050468 -0.0738768 -0.1520394 0.3389469 0.0455383 -0.0452056 -0.0051304 -0.0784875 0.0775614 -0.0071829 0.0106027 0.0023572 0.0635121 0.0910296 0.0783182 0.0076515 0.081174 0.0160923 -0.0258832 -0.0214579 0.0102306 -0.016809 -0.114461 0.0095012 -0.0402756 0.0570003 0.0567587 -0.015816 0.033254 0.0251218 -0.0551142 -0.0680096 -0.0071923 -0.0171508 0.1439385 0.0874824 0.0637481 0.025058 0.0020129 -0.066817 -0.0052447 0.0051034 -0.0220853 0.1488049 0.1112951 -0.0972994 0.1022639 -0.1151903 0.19961 0.0633309 0.1100154 0.0881025 0.2911885 0.0958032 -0.004648 0.0235608 0.0385051 -0.0241263 -0.0086092 0.0188369 -0.003056 0.1619454 -0.0226016 -0.0831169 0.0585762 -0.0949332 0.0136798 0.030199 0.0607254 0.0294618 0.1529885 -0.0745176 0.0628718 0.0652583 0.0543515 0.0766002 -0.0171486 0.0605115 -0.0156757 0.1329149 0.2829191 0.0499236 -0.0914473 0.0432983 0.183946 -0.0058588 -0.1315835 0.0115139 0.2643344 0.5542485 -0.0049383 -0.0921195 -0.1154139 0.2964925 -0.000403 -0.0480499 -0.0558884 0.2540823 unknown
polarizability: 234.1170899|0.5213393|138.7914814|-30.7602939|3.8149865|82.8864181 unknown
InChI: InChI=1S/C10H10N2O4/c11-9(13)6-12-5-7-3-1-2-4-8(7)16-10(12,14)15/h1-5,14H,6,11H2
charge 0 multiplicity 1
26 atoms
O  0.643397 -1.490878 0.333129
O  -1.091533 -0.801189 -1.258858
O  -1.735569 -1.804661 0.72187
O  -3.614918 2.327263 0.377893
N  -0.865015 0.472767 0.845738
N  -3.923108 0.01522 0.145577
C  -2.091022 0.8207 1.576951
C  0.150599 1.300679 0.649895
C  1.387621 0.838631 0.077379
C  -0.914404 -1.040153 0.152962
C  1.615059 -0.584327 -0.007811
C  2.443645 1.743574 -0.251678
C  -3.289184 1.128806 0.626732
C  2.899558 -1.062078 -0.382792
C  3.693337 1.25836 -0.654448
C  3.91656 -0.149547 -0.708871
H  -2.332422 -0.049066 2.212488
H  -1.921325 1.718529 2.191856
H  0.057014 2.344408 0.980122
H  2.26104 2.822734 -0.181665
H  -0.324239 -0.317588 -1.664746
H  3.06183 -2.143103 -0.41836
H  4.499123 1.950948 -0.91484
H  4.898827 -0.528459 -1.011756
H  -4.683827 0.133385 -0.52368
H  -3.493144 -0.912354 0.281815
