program: Gaussian 09
title: 000205673
version: EM64L-G09RevD.01
frameworkgroup: C1[X(C10H8N2O2)]
method: RPBEPBE
basis: SDD
operation: Freq
keyword: #p
keyword: freq=noraman
keyword: PBEPBE/SDD
title: #p freq=noraman PBEPBE/SDD
converged: YES YES NO NO
title: Mulliken charges:
elementType: O O N N C C C C C C C C C C H H H H H H H H
charge: -0.247765 -0.232828 -0.183884 0.000615 -0.440453 0.342987 0.138601 -0.361047 0.228426 -0.402621 -0.343039 -0.241507 -0.207571 -0.110831 0.267812 0.238363 0.236733 0.303549 0.272591 0.267446 0.235385 0.239038
chargesum: 0.00000
title: Mulliken charges with hydrogens summed into heavy atoms:
elementType: O O N N C C C C C C C C C C
charge: -0.247765 -0.232828 -0.183884 0.000615 0.065722 0.342987 0.138601 -0.124314 0.228426 0.173518 -0.075593 -0.006122 0.031467 -0.110831
polarizability: 1.65158436e+02 -1.81518426e+00 1.25014022e+02 3.86000680e-01 -2.28776033e+00 6.67797544e+01
1716.lowfreq: -10.3592 -6.7729 -4.2225 -0.0005 -0.0003 0.0003 30.4499 43.8014 87.0806
frequency: 30.3317 43.7085 87.0793 106.5387 184.3394 250.0024 266.4854 267.0716 331.7837 355.5401 359.4650 420.1225 439.5349 523.2511 556.3028 559.6470 600.6796 673.2499 701.0161 706.1006 721.2418 764.0751 816.7536 861.9716 875.0332 904.1676 944.5369 948.1166 986.1053 1002.5205 1029.8933 1048.1456 1101.9180 1154.5363 1170.0255 1182.9486 1206.3521 1229.7149 1247.3291 1265.7640 1308.5963 1345.7248 1389.0087 1415.9973 1437.1943 1447.4617 1478.8080 1492.8636 1601.3340 1625.3868 1672.8263 2198.7837 2938.8450 2993.9879 3006.9626 3067.6637 3128.1047 3146.6337 3165.6901 3180.2487
redmass: 4.3707 6.4339 6.9573 7.4510 3.2436 3.7612 4.7355 6.6426 7.3488 3.0747 4.9682 5.5989 3.6150 3.6566 6.9475 7.8916 7.4717 9.5258 6.3713 4.3458 4.6152 1.2954 4.4903 1.6729 3.2702 5.8444 1.4518 2.0202 1.3220 1.8197 2.1376 4.4871 2.1809 2.2805 1.1350 2.4996 2.0802 1.8359 1.5639 1.3834 1.6356 1.3471 7.7195 1.9353 1.0792 2.3821 1.7601 1.4589 6.9111 7.5325 10.6257 12.4032 1.0657 1.0622 1.0952 1.0982 1.0887 1.0891 1.0950 1.0992
irintensity: 1.3158 4.6230 2.7409 3.0227 3.8508 6.7560 2.3089 0.5150 10.7484 7.1240 4.4219 4.2419 5.8470 0.2989 4.3424 2.5176 10.2554 16.5248 24.0017 2.3302 6.1889 94.3936 20.2082 2.9066 4.3512 34.0817 2.9195 13.0889 0.1033 0.4952 1.1476 138.3594 23.0602 223.6488 10.3104 199.8609 33.3540 39.1948 12.5583 1.8997 5.2495 11.2415 7.3859 52.7591 47.1038 64.4683 78.6454 9.8230 26.0269 32.7147 415.0413 0.8067 27.6622 25.9692 15.2743 9.4134 4.9631 8.8177 16.4260 7.5636
temp: 298.150 k
press: 1.00000 atm
elementType: 8 8 7 7 6 6 6 6 6 6 6 6 6 6 1 1 1 1 1 1 1 1
symmnumber: 1
zpe: 424468.1 jmol-1
zpe.correction: 0.161671 hartree
zpe.thermalcorrener: 0.173321 hartree
zpe.thermalcorrenthalpy: 0.174265 hartree
zpe.thermalcorrgfe: 0.122494 hartree
zpe.sumelectzpe: -644.812876 hartree
zpe.sumelectthermal: -644.801226 hartree
zpe.sumelectthermalent: -644.800282 hartree
zpe.sumelectthermalfe: -644.852053 hartree
dipole: 3.7281 -3.3187 2.8510
dipole: 5.7480
quadrupole: -81.7331 -88.1626 -82.4413
quadrupole: -1.8790 -10.7198 -4.2217
quadrupole: 2.3792 -4.0503 1.6710 -1.8790 -10.7198 -4.2217
hfenergy: -644.974547 hartree
pointgroup: C01 [X(C10H8N2O2)]
dipole: 1.529666 1.318478 -1.0177992 debye
dipolederiv: -1.9241708 -0.4512001 -0.1767867 -0.289882 -0.5158467 -0.0140766 -0.3230933 -0.0006298 -0.2393321 -1.0069554 -0.4609625 -0.0518684 -0.3377973 -1.030274 -0.0272539 -0.1181775 -0.0450891 -0.3572526 -0.7071164 0.1553245 -0.0153154 0.2721825 -0.9883284 0.0090611 -0.145957 0.1669065 -0.400596 -0.2450103 -0.006787 -0.025332 0.0436487 -0.2210799 0.0109793 0.0599839 -0.0125594 -0.1730538 0.2024003 0.1460807 -0.0270264 0.2326671 0.3604135 0.0841706 0.0130781 0.0301976 0.3687461 0.0377746 -0.0300773 -0.01456 -0.3172911 -0.1628868 -0.0259736 -0.0043603 0.0217459 -0.0731544 0.8934362 0.4158232 0.0030171 0.7775885 0.4346114 0.0420003 -0.0201507 -0.0161358 0.0845566 -0.0017234 -0.0330636 0.0116189 0.0421788 0.105812 -0.027262 0.0045824 -0.032535 -0.1359948 2.2007821 0.466007 0.2754104 -0.2078069 1.7399112 -0.1201667 0.500983 -0.0846433 0.3945389 0.7398584 -0.2871938 0.0142813 -0.1358563 0.1804173 -0.0668019 0.0803839 -0.1205229 0.3626999 -0.2884199 -0.1578234 -0.0036108 -0.0669546 0.0291651 -0.0359709 -0.0021077 -0.0438919 -0.1423959 -0.0612202 0.0997646 -0.0058746 0.0787842 -0.0470443 -0.0184025 -0.0008648 -0.0135669 -0.1604258 0.1211732 0.0035791 0.0229467 -0.0388916 0.0594834 -0.0271564 0.0225619 -0.0292353 -0.1444674 -0.1184149 0.0269551 -0.0565873 -0.0041621 -0.0137473 0.0538353 -0.0691256 0.0332548 -0.0702372 -0.0315927 0.0243215 0.0531227 -0.0156828 -0.0154641 -0.0493294 0.0518577 -0.112308 -0.0419671 0.0377529 -0.0004361 -0.0367878 0.003644 -0.0494579 0.0675242 -0.0565704 0.1116582 -0.0267811 0.0728383 0.0659863 -0.0168566 0.0270154 -0.0763534 0.0313034 -0.0132423 0.0384492 0.1436254 0.0783973 0.0167192 0.0292951 -0.1274341 0.1232486 -0.0471096 0.0585041 -0.0053391 0.1343885 0.0204886 0.0438881 0.0539385 0.0940973 0.0305698 0.1032754 -0.0011847 0.0548949 -0.0141124 0.1073519 0.0065575 -0.0052009 0.0225821 -0.0230968 0.0271794 -0.010998 0.0241182 0.1702255 -0.0304452 -0.0949258 -0.0010561 -0.1042826 0.0044552 0.0152273 0.0002466 0.01886 0.1640691 -0.0971845 0.0514628 -0.0267679 0.0516527 0.0754921 0.0149471 -0.0263494 0.0163712 0.1569207 unknown
polarizability: 165.1431916|0.9128464|125.0407426|2.7814653|0.2258952|66.768278 unknown
InChI: InChI=1S/C10H8N2O2/c11-5-6-12-7-8-3-1-2-4-9(8)14-10(12)13/h1-4H,6-7H2
charge 0 multiplicity 1
22 atoms
O  0.351266 -1.638939 0.208651
O  -1.782084 -2.314324 -0.30329
N  -1.272666 -0.036522 -0.497048
N  -4.014347 1.642639 0.923248
C  -0.405349 1.124732 -0.180878
C  1.047101 0.714236 -0.072997
C  1.365308 -0.643461 0.130833
C  2.104121 1.650693 -0.129711
C  -0.975363 -1.366546 -0.204552
C  -2.652044 0.260849 -0.919398
C  2.692642 -1.087122 0.28683
C  3.44343 1.231474 0.02627
C  3.73524 -0.138277 0.23674
C  -3.413719 1.018444 0.103551
H  -0.749327 1.597885 0.764512
H  -0.533333 1.876909 -0.983429
H  1.87662 2.711267 -0.29114
H  -3.158806 -0.701245 -1.112918
H  -2.64247 0.847994 -1.85812
H  2.884262 -2.15263 0.441728
H  4.254145 1.965618 -0.016682
H  4.772272 -0.467675 0.357802
