program: Gaussian 09
title: 000213642
version: EM64L-G09RevD.01
frameworkgroup: C1[X(C23H26ClN3O)]
method: RPBEPBE
basis: SDD
operation: Freq
keyword: #p
keyword: freq=noraman
keyword: PBEPBE/SDD
title: #p freq=noraman PBEPBE/SDD
converged: YES YES NO NO
title: Mulliken charges:
elementType: Cl O N N N C C C C C C C C C C C C C C C C C C C C C C C H H H H H H H H H H H H H H H H H H H H H H H H H H
charge: -0.050772 -0.284536 -0.059383 -0.412424 -0.156198 -0.055029 -0.470097 -0.422439 -0.369799 -0.389557 -0.348201 -0.573465 0.404509 0.110825 -0.463315 0.240868 0.166781 -0.413691 -0.351046 0.274572 -0.636237 -0.258241 -0.230009 -0.342616 -0.341881 -0.214387 -0.223757 -0.094351 0.269498 0.219864 0.210491 0.240065 0.210759 0.150205 0.222221 0.220063 0.179640 0.195694 0.221877 0.209543 0.224052 0.299729 0.266569 0.227702 0.231872 0.230895 0.238267 0.238487 0.218320 0.219859 0.281769 0.219631 0.259708 0.257097
chargesum: 0.00000
title: Mulliken charges with hydrogens summed into heavy atoms:
elementType: Cl O N N N C C C C C C C C C C C C C C C C C C C C C C C
charge: -0.050772 -0.284536 -0.059383 -0.112695 -0.156198 0.214469 -0.039742 0.028385 0.002627 0.010145 0.069370 -0.139869 0.404509 0.110825 -0.196746 0.240868 0.166781 -0.185989 -0.119174 0.274572 0.071411 -0.039920 -0.010150 -0.060847 -0.122251 0.045321 0.033341 -0.094351
polarizability: 3.39650891e+02 -2.70294486e+01 3.22368367e+02 -2.55388991e+00 2.39580923e+01 1.91834149e+02
1716.lowfreq: -4.4036 -0.0014 -0.0012 -0.0007 2.3979 5.8029 9.8598 11.8905 21.3646
frequency: 9.7488 10.4353 21.1814 29.0198 34.8038 52.7889 58.1388 68.7772 75.5762 92.1378 106.2600 136.2245 141.6804 163.1258 187.8202 212.4305 224.8116 233.1856 236.4034 245.1381 261.6722 283.3940 299.3588 318.0407 332.1588 377.2868 393.5704 406.5842 409.9694 426.3669 450.0363 462.3491 487.5896 504.4175 516.1780 524.1660 529.7755 533.4138 563.6886 573.3425 612.6422 623.5320 651.4133 667.0141 687.1024 697.9669 741.2277 745.6390 746.4238 753.9006 764.8271 780.2400 784.7874 797.9583 805.6142 816.3295 822.5667 846.6487 851.8750 880.8015 906.3002 926.9091 946.6484 957.4035 966.9875 986.5024 987.7960 999.1730 1004.6097 1009.2253 1010.7551 1020.0360 1037.8595 1054.1227 1057.5914 1072.6664 1089.8338 1101.2848 1109.0149 1118.5592 1123.6301 1127.7069 1130.9251 1136.6973 1149.0773 1166.5026 1177.5266 1181.9400 1185.4004 1204.1971 1231.2077 1248.9908 1254.6218 1258.7691 1285.7904 1288.1313 1293.9195 1298.7418 1308.7672 1330.9972 1334.2811 1337.1639 1349.1011 1363.7035 1364.5272 1367.1762 1368.8982 1372.7374 1392.3627 1392.9886 1412.9982 1435.3779 1442.8769 1455.4688 1457.2001 1458.5941 1466.7682 1469.1275 1471.2229 1473.7608 1481.5140 1482.3726 1491.8567 1496.1586 1561.7177 1563.4597 1581.1427 1596.1879 1600.9041 1625.6894 2758.2352 2829.6121 2860.2130 2974.7736 2980.0122 2998.1554 3002.8463 3024.0638 3031.7767 3035.8952 3043.2710 3050.2331 3052.6010 3064.7174 3073.5018 3105.0972 3119.3129 3128.4916 3129.0824 3142.3517 3156.8021 3160.5212 3170.9922 3176.6781 3209.7138 3549.2124
redmass: 7.3948 4.9770 4.3569 4.6259 5.5746 4.0968 3.3259 1.1587 4.4982 6.1962 4.2083 2.7790 4.3041 3.9673 3.7560 2.9670 3.5848 3.6000 3.3691 3.5476 3.9728 4.5005 6.1424 4.6237 2.4345 2.1458 3.0129 2.8943 3.2685 2.8354 3.5933 3.4053 3.9522 5.0171 2.9958 3.3464 3.3562 1.5799 4.8054 3.7320 3.4453 6.9388 3.5850 3.1493 3.2882 7.1090 3.4580 2.9791 1.3859 3.6307 3.9222 1.8803 1.6675 1.6426 2.0928 3.5450 1.4279 1.5097 1.5001 3.3906 2.4385 1.3831 1.5002 2.2195 1.2987 1.4235 2.3740 3.9868 1.8257 2.6730 2.2042 1.9365 3.2139 2.1661 2.1472 2.7896 1.5525 2.0789 1.4469 1.3052 2.4403 1.6990 1.8899 2.7373 2.6527 1.2221 1.2320 1.1450 1.1465 1.4765 1.7406 1.6115 1.6417 1.4626 1.3623 1.1727 1.2786 1.5120 1.5457 1.5854 1.8496 1.5964 1.4858 2.0255 1.4680 1.9094 4.7967 2.5695 4.0092 1.4620 4.3399 1.5551 1.0974 1.0950 1.7839 1.1029 1.0418 1.1180 2.5877 1.1869 2.2190 1.3218 1.8318 1.1711 6.1478 7.8652 6.7867 6.3398 7.5731 7.2221 1.0711 1.0709 1.0701 1.0357 1.0625 1.0619 1.0627 1.0874 1.0860 1.0853 1.0867 1.1018 1.0991 1.1010 1.1019 1.0985 1.0852 1.0884 1.0893 1.0949 1.0887 1.1000 1.0953 1.0972 1.0980 1.0768
irintensity: 0.0131 0.8462 1.0010 0.2983 0.2525 5.1759 0.8659 0.1166 0.2324 4.6350 0.4111 3.4750 1.2147 0.7497 7.8890 0.3436 2.2618 5.4020 1.8351 1.4469 7.2876 0.2162 2.2719 0.6126 1.8813 2.9364 0.3930 3.0105 7.4864 11.5237 2.2969 11.2824 3.9720 10.6529 18.0175 0.1307 23.8961 59.3640 10.3260 0.0558 1.8733 0.9580 10.3260 11.4906 3.5741 5.7261 25.8669 11.9943 104.7767 8.8769 2.5922 4.9832 6.9189 8.6072 12.7287 6.6446 15.3651 0.1851 34.3845 14.3567 11.5230 1.6664 3.1967 4.5441 0.0373 7.6889 23.9208 36.0241 2.2460 6.8360 4.8913 8.1080 17.4110 9.0176 23.0231 42.4955 13.8187 10.4408 13.3731 0.9278 29.0021 8.9041 26.2607 2.8787 58.6486 6.7678 1.4882 11.2974 6.3566 6.8336 9.2388 13.9708 57.3678 16.9672 17.3246 6.8763 1.4839 16.6067 13.0608 8.3097 39.7442 20.7003 13.2618 12.1157 7.0623 2.4563 2.7255 35.1895 2.8957 0.3444 32.0399 1.3954 32.7078 28.1100 368.6550 5.8743 13.2562 1.0717 13.5160 5.8088 39.6945 37.9289 146.3760 11.5382 8.0100 64.1292 0.3275 87.4040 70.3871 5.2515 123.0228 92.5387 108.4364 90.9240 31.2093 27.0736 16.8326 5.0850 52.1364 26.2689 38.3071 28.8162 38.1314 26.4520 34.8065 11.7071 5.6954 4.3256 14.6626 43.4190 0.1159 28.9683 4.1307 2.5131 1.1902 28.3636
temp: 298.150 k
press: 1.00000 atm
elementType: 17 8 7 7 7 6 6 6 6 6 6 6 6 6 6 6 6 6 6 6 6 6 6 6 6 6 6 6 1 1 1 1 1 1 1 1 1 1 1 1 1 1 1 1 1 1 1 1 1 1 1 1 1 1
symmnumber: 1
zpe: 1162255.1 jmol-1
zpe.correction: 0.442680 hartree
zpe.thermalcorrener: 0.468728 hartree
zpe.thermalcorrenthalpy: 0.469672 hartree
zpe.thermalcorrgfe: 0.381339 hartree
zpe.sumelectzpe: -1589.563551 hartree
zpe.sumelectthermal: -1589.537503 hartree
zpe.sumelectthermalent: -1589.536559 hartree
zpe.sumelectthermalfe: -1589.624892 hartree
dipole: 5.4041 0.3735 0.0542
dipole: 5.4172
quadrupole: -167.1468 -181.1880 -168.1354
quadrupole: -10.2014 -15.0197 1.9099
quadrupole: 5.0099 -9.0313 4.0214 -10.2014 -15.0197 1.9099
hfenergy: -1590.006231 hartree
pointgroup: C01 [X(C23H26Cl1N3O1)]
dipole: -2.1311365 -0.0170319 -0.0210914 debye
polarizability: 335.3966983|28.0370236|327.0865447|-0.4515094|-22.7485156|191.370164 unknown
InChI: InChI=1S/C23H26ClN3O/c1-26-16-18(21-4-2-3-5-22(21)26)10-13-27-14-11-20(12-15-27)25-23(28)17-6-8-19(24)9-7-17/h2-9,16,20,25H,10-15H2,1H3
charge 0 multiplicity 1
54 atoms
Cl 7.316447 4.105354 0.441455
O  4.888911 -2.302337 0.518134
N  -0.537824 -1.968078 -0.056989
N  3.074061 -1.288646 -0.515368
N  -6.263529 -0.337807 0.845386
C  2.313481 -2.554137 -0.644004
C  1.242687 -2.418418 -1.749278
C  1.632034 -2.955252 0.691226
C  0.07581 -1.500669 -1.320705
C  0.467035 -2.011256 1.03971
C  -1.746691 -1.194426 0.322214
C  -2.978601 -1.516798 -0.566599
C  -4.220598 -0.786912 -0.115585
C  -4.515781 0.626666 -0.286132
C  -5.305778 -1.331047 0.57287
C  -5.798088 0.875988 0.32448
C  4.333025 -1.253606 0.053854
C  -3.830417 1.70681 -0.903694
C  -6.395846 2.156612 0.335024
C  5.020955 0.089507 0.106733
C  -7.538671 -0.527652 1.536006
C  -4.421869 2.985238 -0.899059
C  -5.690262 3.20839 -0.284288
C  6.107797 0.225077 1.00771
C  4.659684 1.195955 -0.705808
C  6.810235 1.441904 1.120277
C  5.354729 2.421349 -0.609089
C  6.417044 2.525719 0.309845
H  3.050855 -3.332326 -0.911363
H  0.832561 -3.423736 -1.95483
H  1.699181 -2.040697 -2.684284
H  2.384757 -2.958451 1.499217
H  1.240624 -3.98477 0.584964
H  0.432302 -0.433747 -1.223534
H  -0.688743 -1.497069 -2.117075
H  -0.037245 -2.367321 1.956538
H  0.868979 -0.987341 1.264028
H  -1.554422 -0.090985 0.308113
H  -2.001489 -1.457021 1.365858
H  -2.758658 -1.254813 -1.620534
H  -3.136427 -2.610591 -0.537773
H  2.603595 -0.418654 -0.768279
H  -5.472012 -2.360323 0.888972
H  -2.856247 1.549061 -1.381364
H  -7.370567 2.334304 0.802746
H  -7.636894 -1.581929 1.840067
H  -7.596709 0.102576 2.443094
H  -8.390606 -0.274501 0.877282
H  -3.904424 3.826741 -1.373413
H  -6.123079 4.215084 -0.295352
H  6.391499 -0.646039 1.606712
H  3.860108 1.114276 -1.451364
H  7.645037 1.546456 1.818939
H  5.082945 3.272185 -1.240093
