program: Gaussian 09
title: 000205670
version: EM64L-G09RevD.01
frameworkgroup: C1[X(C11H12N2O3)]
method: RPBEPBE
basis: SDD
operation: Freq
keyword: #p
keyword: freq=noraman
keyword: PBEPBE/SDD
title: #p freq=noraman PBEPBE/SDD
converged: YES YES NO NO
title: Mulliken charges:
elementType: O O O N N C C C C C C C C C C C H H H H H H H H H H H H
charge: -0.251885 -0.279489 -0.264874 -0.181526 -0.610382 -0.162552 -0.471764 0.343928 0.155592 0.226997 -0.753642 0.228316 -0.377932 -0.349065 -0.239993 -0.208098 0.283914 0.266382 0.256055 0.224612 0.242589 0.251466 0.238298 0.265725 0.233898 0.237229 0.369347 0.326852
chargesum: 0.00000
title: Mulliken charges with hydrogens summed into heavy atoms:
elementType: O O O N N C C C C C C C C C C C
charge: -0.251885 -0.279489 -0.264874 -0.181526 0.085817 0.121362 0.050672 0.343928 0.155592 0.226997 -0.034974 0.228316 -0.139633 -0.083339 -0.006095 0.029131
polarizability: 1.84454136e+02 -4.96013532e+00 1.45383680e+02 3.69578196e-01 3.53385956e+00 8.10382213e+01
1716.lowfreq: -11.9484 -0.0009 -0.0006 0.0005 4.2238 10.5254 30.5822 55.6481 68.2079
frequency: 30.1339 55.5848 68.1912 97.3115 148.1144 166.8998 218.5108 220.6285 249.2188 260.6511 296.0229 323.0786 338.1579 393.9846 423.4525 443.5283 492.6521 525.8810 551.5699 584.4236 599.6473 619.9195 651.7286 681.9692 705.0533 719.3000 728.2915 744.5448 764.4802 787.7684 806.6101 861.0287 879.6904 942.7519 955.1119 985.4754 998.9960 1022.6103 1029.6639 1060.0212 1092.2300 1101.4302 1146.4250 1161.7851 1167.7129 1172.2664 1222.2095 1235.8266 1247.3356 1276.2264 1281.7651 1347.1283 1356.5229 1386.5207 1391.9549 1410.0455 1446.1167 1457.9209 1477.0925 1487.9991 1491.8476 1588.1839 1601.3576 1623.6184 1645.9636 1650.4384 2945.4211 2999.6311 3045.7194 3070.7006 3097.5058 3106.9660 3128.6487 3145.2891 3164.0651 3178.9868 3415.7830 3618.7697
redmass: 4.6292 5.4057 5.9823 5.7936 5.5950 3.9064 1.6461 1.9041 2.4660 4.1499 4.9948 6.0262 4.1044 4.6223 4.0659 4.3130 3.4804 3.6454 5.8101 2.5790 4.6334 4.5432 1.9433 4.4967 3.3533 1.4650 5.0167 2.9848 1.3128 3.2034 3.8480 1.5757 3.7073 1.4637 3.2108 1.3222 1.9559 1.6286 2.0343 1.8160 2.1651 2.0830 2.9952 2.5605 2.2495 1.2578 1.9395 2.8600 1.3422 1.5854 1.5779 1.6026 2.3128 2.4924 1.7078 1.9363 2.3244 1.0695 1.6590 1.1969 1.2888 1.7045 6.2816 4.9803 3.4746 8.2928 1.0710 1.0359 1.0854 1.0901 1.0987 1.1006 1.0883 1.0894 1.0951 1.0991 1.0530 1.0983
irintensity: 0.5418 5.1231 9.1597 1.3853 8.0297 0.6710 3.9118 3.5872 15.8737 0.1589 7.6744 3.5673 2.8387 3.7168 7.3376 6.1869 7.7625 0.2490 2.8707 44.8284 13.5773 11.4953 117.9840 32.6764 4.7083 203.4352 15.9544 27.0221 93.0117 1.7138 2.5588 1.8774 6.4523 6.4164 85.1320 0.7920 27.8340 15.1116 3.4055 9.2789 1.7009 23.5871 27.2069 356.2658 42.2651 88.1010 28.8727 44.9633 21.2899 32.7977 19.0687 9.4698 38.7806 23.6527 24.0081 51.3938 51.4868 12.0874 79.9468 13.7434 7.7726 272.3713 2.7664 27.2833 22.9091 466.6239 22.8754 14.1510 3.2634 7.6870 24.4717 10.9087 3.8205 9.5432 18.0896 8.8736 90.2129 65.2681
temp: 298.150 k
press: 1.00000 atm
elementType: 8 8 8 7 7 6 6 6 6 6 6 6 6 6 6 6 1 1 1 1 1 1 1 1 1 1 1 1
symmnumber: 1
zpe: 573119.3 jmol-1
zpe.correction: 0.218290 hartree
zpe.thermalcorrener: 0.232385 hartree
zpe.thermalcorrenthalpy: 0.233329 hartree
zpe.thermalcorrgfe: 0.176775 hartree
zpe.sumelectzpe: -760.409540 hartree
zpe.sumelectthermal: -760.395445 hartree
zpe.sumelectthermalent: -760.394500 hartree
zpe.sumelectthermalfe: -760.451054 hartree
dipole: 2.4577 -1.6767 0.5141
dipole: 3.0192
quadrupole: -85.7081 -98.2360 -94.1575
quadrupole: -9.0781 -3.0380 -6.6113
quadrupole: 6.9924 -5.5355 -1.4570 -9.0781 -3.0380 -6.6113
hfenergy: -760.6278292 hartree
pointgroup: C01 [X(C11H12N2O3)]
dipole: -0.9084951 -0.4750882 -0.5999455 debye
polarizability: 183.2918186|3.4955841|130.0132878|8.8749859|28.2841837|97.5709308 unknown
InChI: InChI=1S/C11H12N2O3/c1-7(10(12)14)13-6-8-4-2-3-5-9(8)16-11(13)15/h2-5,7H,6,12H2,1H3
charge 0 multiplicity 1
28 atoms
O  -0.917945 1.338613 0.958615
O  1.199905 2.219483 0.989237
O  3.553277 -1.66941 0.580386
N  0.868033 0.191767 -0.140013
N  3.375097 0.388784 1.669649
C  2.313042 0.168895 -0.540397
C  0.082178 -1.068167 -0.213384
C  -1.402349 -0.767967 -0.220341
C  -1.846814 0.429226 0.376353
C  0.454402 1.278042 0.610215
C  2.553845 -0.560033 -1.867787
C  3.1509 -0.468352 0.61447
C  -2.36716 -1.645565 -0.762612
C  -3.209642 0.76942 0.458615
C  -3.742931 -1.330905 -0.689479
C  -4.161634 -0.12469 -0.077308
H  2.602726 1.229646 -0.635377
H  0.35099 -1.72728 0.640031
H  0.368431 -1.600809 -1.134242
H  1.824184 -0.238532 -2.631504
H  3.565822 -0.312913 -2.231809
H  2.521612 -1.654939 -1.741813
H  -2.041249 -2.579185 -1.236337
H  -3.500199 1.71171 0.931572
H  -4.483717 -2.019565 -1.108285
H  -5.226856 0.122307 -0.020937
H  2.935536 1.317598 1.678698
H  3.874419 0.042318 2.489184
