program: Gaussian 09
title: 000213636
version: EM64L-G09RevD.01
frameworkgroup: C1[X(C23H27N3O)]
method: RPBEPBE
basis: SDD
operation: Freq
keyword: #p
keyword: freq=noraman
keyword: PBEPBE/SDD
title: #p freq=noraman PBEPBE/SDD
converged: YES YES NO NO
title: Mulliken charges:
elementType: O N N N C C C C C C C C C C C C C C C C C C C C C C C H H H H H H H H H H H H H H H H H H H H H H H H H H H
charge: -0.283397 -0.059110 -0.395075 -0.407495 -0.071207 -0.435911 -0.464454 -0.365323 -0.392316 -0.344460 -0.572430 0.411740 0.212431 0.106811 -0.450157 0.224352 -0.650868 -0.409749 0.404049 -0.353913 -0.262013 -0.218575 -0.391649 -0.384987 -0.223315 -0.225636 -0.241352 0.269021 0.237910 0.210603 0.216830 0.210511 0.213908 0.181553 0.167228 0.222489 0.219169 0.194468 0.334409 0.222515 0.213802 0.269771 0.244975 0.246475 0.303303 0.229379 0.225843 0.218304 0.220463 0.239246 0.241092 0.228735 0.230937 0.231068
chargesum: 0.00000
title: Mulliken charges with hydrogens summed into heavy atoms:
elementType: O N N N C C C C C C C C C C C C C C C C C C C C C C C
charge: -0.283397 -0.059110 -0.060666 -0.104193 0.197814 0.012602 -0.037114 0.030139 -0.002598 0.069178 -0.136113 0.411740 0.212431 0.106811 -0.180385 0.224352 -0.159418 -0.180370 0.404049 -0.128070 -0.043708 0.001888 -0.152403 -0.143894 0.005419 0.005301 -0.010285
polarizability: 2.95877826e+02 3.14301096e+01 2.74830714e+02 1.62800860e+01 -8.24833444e+00 2.17133741e+02
1716.lowfreq: -15.1513 -6.8459 -3.3109 -0.0003 0.0004 0.0006 4.0271 8.7410 15.4463
frequency: -13.6807 8.0330 14.2086 25.2215 33.4694 42.7712 50.5770 64.6415 89.2290 92.3790 132.2979 162.5627 173.4458 215.6704 218.6912 222.3065 237.4024 255.0382 309.2262 316.3314 327.1614 355.9837 385.2224 397.4046 402.6078 407.5060 423.0421 457.6383 468.4209 479.2798 497.9867 508.4354 538.9789 562.3362 575.6971 584.6827 594.5574 605.7567 610.6538 617.0946 633.3373 680.5163 706.1522 723.8894 746.2034 746.9981 758.2587 760.7473 779.5326 784.9625 802.9585 806.0718 826.3852 847.6093 854.2122 858.2727 867.6245 895.7361 918.1474 921.1233 925.9465 928.7103 967.5099 979.9631 985.0839 989.2933 992.9122 997.8287 1005.6374 1010.3409 1017.1969 1026.2770 1039.5012 1059.3912 1068.0936 1079.9351 1089.7941 1095.8347 1112.9456 1132.2119 1135.6426 1143.6313 1164.7289 1171.1672 1174.5211 1175.7031 1185.9829 1187.7484 1208.2736 1219.6827 1227.9378 1239.2555 1252.5089 1259.2514 1281.3680 1284.2921 1288.6002 1294.1619 1306.8930 1308.6494 1325.7021 1333.8532 1340.7103 1345.1663 1348.4290 1361.5564 1371.0181 1379.3080 1389.8818 1393.0849 1420.4783 1438.2595 1445.6881 1447.3787 1458.6842 1459.6826 1460.6694 1469.9487 1471.1548 1479.9036 1481.7254 1482.9091 1489.1198 1563.9801 1586.5353 1588.9624 1605.1811 1613.9653 1631.2390 2790.3494 2819.0263 2855.1053 2983.0664 2995.9241 3002.3107 3007.7206 3019.2583 3024.6950 3029.2528 3046.2379 3053.4481 3061.9027 3062.7213 3072.0450 3118.4176 3120.4081 3120.8419 3127.9964 3135.5304 3142.1411 3146.6788 3160.6756 3164.8070 3219.2643 3522.0194 3613.8797
redmass: 4.4744 5.2414 4.6149 4.2109 4.0874 4.9746 5.9717 4.0726 3.6517 3.1178 4.2068 5.0192 3.2339 3.1794 3.5133 2.7191 4.2126 3.0417 3.1707 2.2490 4.2533 2.6671 2.6307 2.5183 2.8319 3.4105 2.8264 3.4766 3.3734 3.3737 1.2997 2.9397 5.7446 2.5589 3.0970 4.0543 3.9795 1.4921 3.3534 6.1565 3.2518 2.6443 1.8056 3.9405 2.2830 1.6486 3.4080 1.9920 2.2017 1.4949 1.5627 1.8401 3.7562 1.5106 3.0780 1.2501 5.0822 2.6037 1.9153 2.8949 1.6189 1.3856 1.2986 1.3863 2.6788 6.0967 2.3814 1.3722 1.6040 2.0447 1.9778 2.1905 3.3190 2.1926 3.0338 1.5964 1.7355 1.4716 2.4006 1.4897 2.6164 2.6009 1.1267 1.1000 1.1863 1.0959 1.1830 1.1190 1.9027 2.1120 1.7239 2.3588 1.4120 1.4219 1.5195 1.5438 1.2466 1.5980 1.7257 1.5258 1.2750 1.4309 1.4410 1.4216 1.7406 1.3650 1.3785 8.0307 4.6732 1.4814 2.3552 2.1392 1.1323 1.1015 1.4881 1.4680 1.4155 1.1980 1.0856 1.3453 2.8869 2.3254 1.2878 6.2743 6.2025 5.9922 7.5525 6.5150 6.8793 1.0718 1.0713 1.0700 1.0622 1.0628 1.0628 1.0607 1.0871 1.0842 1.0854 1.0880 1.0990 1.1003 1.1015 1.1017 1.0871 1.0848 1.0871 1.0889 1.0911 1.0952 1.0959 1.1001 1.1015 1.0983 1.0772 1.0809
irintensity: 0.1313 0.4387 0.2415 0.1479 0.1600 0.9465 7.5433 2.1692 0.1400 0.2382 0.6205 1.8717 2.6253 4.1254 3.6869 3.1214 9.4401 0.9325 2.7453 0.8930 5.6137 1.4007 1.1247 6.7574 0.0806 1.2406 13.6659 3.4691 6.2473 8.4715 79.2969 23.0924 0.8481 26.3815 8.5662 10.9650 11.8492 20.9615 22.9148 1.2707 0.7423 0.3418 59.9897 2.4981 37.1857 75.7539 6.2066 35.7729 11.9483 2.0780 2.5959 15.2246 3.7119 0.4105 2.5115 0.2615 1.4893 3.8088 1.4061 2.9053 2.0800 2.0442 0.0941 0.1055 25.5254 0.3576 11.0195 1.4058 0.3558 8.0092 14.3037 4.9498 6.9213 1.5692 5.8784 11.4497 27.0650 33.2132 27.6671 4.9299 2.7794 41.3884 2.0214 0.2009 2.2184 0.1777 10.5261 0.8448 16.4628 21.9178 15.9321 19.8560 7.7171 4.8776 22.8373 3.4502 2.6172 9.1239 7.6256 9.8577 0.2689 22.5132 14.6288 2.1569 22.4919 7.7434 2.4051 0.0565 31.4231 4.0040 2.6275 7.1633 77.9676 24.6645 2.2089 29.0284 18.2213 53.1670 8.8382 93.5830 7.8748 17.9149 109.5900 2.1701 0.1814 1.5112 267.2602 41.5542 2.3455 97.7170 96.5350 108.3010 28.5892 22.9110 15.5286 14.1367 2.8868 41.8873 56.9275 41.1160 31.9989 3.5084 30.1952 29.9714 6.5275 3.8629 3.8278 4.1641 8.0436 45.2091 36.5608 28.3096 18.3985 1.2977 29.1907 61.9670
temp: 298.150 k
press: 1.00000 atm
elementType: 8 7 7 7 6 6 6 6 6 6 6 6 6 6 6 6 6 6 6 6 6 6 6 6 6 6 6 1 1 1 1 1 1 1 1 1 1 1 1 1 1 1 1 1 1 1 1 1 1 1 1 1 1 1
symmnumber: 1
zpe: 1190266.3 jmol-1
zpe.correction: 0.453349 hartree
zpe.thermalcorrener: 0.476696 hartree
zpe.thermalcorrenthalpy: 0.477640 hartree
zpe.thermalcorrgfe: 0.396440 hartree
zpe.sumelectzpe: -1130.179299 hartree
zpe.sumelectthermal: -1130.155952 hartree
zpe.sumelectthermalent: -1130.155007 hartree
zpe.sumelectthermalfe: -1130.236208 hartree
dipole: 3.5576 1.6825 4.0099
dipole: 5.6184
quadrupole: -152.1687 -160.3329 -159.0442
quadrupole: -14.3771 -3.3008 -7.9985
quadrupole: 5.0132 -3.1510 -1.8623 -14.3771 -3.3008 -7.9985
hfenergy: -1130.6326471 hartree
pointgroup: C01 [X(C23H27N3O1)]
dipole: -1.5291434 0.6482435 -1.4586491 debye
polarizability: 290.6013921|-30.6593876|285.4541577|9.9042327|0.8597326|211.7867312 unknown
InChI: InChI=1S/C23H27N3O/c27-23(16-18-6-2-1-3-7-18)25-20-11-14-26(15-12-20)13-10-19-17-24-22-9-5-4-8-21(19)22/h1-9,17,20,24-25H,10-16H2
charge 0 multiplicity 1
54 atoms
O  4.734224 -2.399599 1.435242
N  -0.483789 -2.034996 -0.181632
N  3.191146 -1.669702 -0.14292
N  -6.105943 0.097924 0.000119
C  2.357922 -2.892639 -0.081681
C  1.437439 -2.893648 1.16695
C  1.494264 -3.006785 -1.357849
C  0.321992 -1.837719 1.053126
C  0.370814 -1.947701 -1.391245
C  -1.647581 -1.11739 -0.268046
C  -2.773039 -1.466039 0.742486
C  -3.996989 -0.601046 0.562227
C  4.318978 -1.509486 0.62923
C  -4.129926 0.809151 0.898727
C  -5.220864 -0.993033 0.020044
C  -5.462881 1.219713 0.535238
C  5.083995 -0.170321 0.467198
C  -3.255672 1.764916 1.483576
C  4.49501 0.832385 -0.509064
C  -5.930979 2.53785 0.73315
C  -3.716558 3.080007 1.686562
C  -5.039667 3.463337 1.313011
C  4.940963 0.887002 -1.85619
C  3.460196 1.718415 -0.104266
C  4.371447 1.799171 -2.773627
C  2.887501 2.631635 -1.018366
C  3.340887 2.674261 -2.357789
H  3.054517 -3.74779 -0.005878
H  2.047795 -2.715644 2.070057
H  0.976555 -3.89539 1.2592
H  1.027292 -4.008527 -1.368775
H  2.126746 -2.916342 -2.261856
H  -0.342924 -1.915606 1.930784
H  0.774304 -0.809105 1.07239
H  0.812058 -0.918276 -1.505862
H  -0.264005 -2.115176 -2.28089
H  -2.068282 -1.199285 -1.288016
H  -1.340724 -0.048473 -0.132206
H  2.905197 -0.903236 -0.756818
H  -3.027876 -2.533262 0.607392
H  -2.393277 -1.357427 1.777387
H  -5.527289 -1.971014 -0.347703
H  5.151909 0.257846 1.484471
H  6.115529 -0.445853 0.180935
H  -7.065867 0.071837 -0.335272
H  -2.238215 1.482768 1.778265
H  -6.946984 2.836706 0.450953
H  -3.053532 3.825838 2.139278
H  -5.368745 4.494811 1.482143
H  5.74208 0.213082 -2.183967
H  3.110691 1.697575 0.93553
H  4.73307 1.830319 -3.807635
H  2.094014 3.310825 -0.686761
H  2.900469 3.384134 -3.066658
